null
SMILES: COc1cc(C(=O)N[C@H]2CCN(C)C[C@H]2F)c(C)cc1Nc1ncc(Cl)c(Oc2cccc3CN(C)C(=O)c23)n1
InChI Key: InChIKey=QXWFIOPKELPUBS-UXHICEINSA-N
Activity Spreadsheet -- Enzyme Inhibition Constant Data from BindingDB
Found 1 hit for monomerid = 134168
Trg + Lig
Ki
nM
ΔG°
kcal/mole
IC50
nM
Kd
nM
EC50/IC50
nM
koff
s-1
kon
M-1s-1
pHTemp
°C
Focal adhesion kinase 1
(Homo sapiens (Human))
BDBM134168
(US8846689, 170)
Show SMILES COc1cc(C(=O)N[C@H]2CCN(C)C[C@H]2F)c(C)cc1Nc1ncc(Cl)c(Oc2cccc3CN(C)C(=O)c23)n1 |r|
Show InChI InChI=1S/C28H30ClFN6O4/c1-15-10-21(23(39-4)11-17(15)25(37)32-20-8-9-35(2)14-19(20)30)33-28-31-12-18(29)26(34-28)40-22-7-5-6-16-13-36(3)27(38)24(16)22/h5-7,10-12,19-20H,8-9,13-14H2,1-4H3,(H,32,37)(H,31,33,34)/t19-,20+/m1/s1
NCI pathway
Reactome pathway
US Patent
n/an/a 1n/an/an/an/a7.5n/a
Boehringer Ingelheim International GmbH
US Patent
Assay Description
This test uses active PTK2 enzyme (Invitrogen Code PV3832) and poly-Glu-Tyr (4:1, Sigma P-0275) as the kinase substrate. The kinase activity is detec...
US Patent US8846689 (2014)
BindingDB Entry DOI: 10.7270/Q2BC3X7Z