BDBM134184 US8846689, 186
SMILES: COCCN1CCC(CC1)NC(=O)c1ccc(Nc2ncc(c(Oc3cccc4CN(C)C(=O)c34)n2)C(F)(F)F)c(C)c1
InChI Key: InChIKey=MPFLJFPOUPQONG-UHFFFAOYSA-N
Data: 1 IC50
Activity Spreadsheet -- Enzyme Inhibition Constant Data from BindingDB
Found 1 hit for monomerid = 134184
Trg + Lig
Ki
nM
ΔG°
kcal/mole
IC50
nM
Kd
nM
EC50/IC50
nM
koff
s-1
kon
M-1s-1
pHTemp
°C
Focal adhesion kinase 1
(Homo sapiens (Human))
BDBM134184
(US8846689, 186)
Show SMILES COCCN1CCC(CC1)NC(=O)c1ccc(Nc2ncc(c(Oc3cccc4CN(C)C(=O)c34)n2)C(F)(F)F)c(C)c1
Show InChI InChI=1S/C30H33F3N6O4/c1-18-15-19(26(40)35-21-9-11-39(12-10-21)13-14-42-3)7-8-23(18)36-29-34-16-22(30(31,32)33)27(37-29)43-24-6-4-5-20-17-38(2)28(41)25(20)24/h4-8,15-16,21H,9-14,17H2,1-3H3,(H,35,40)(H,34,36,37)
NCI pathway
Reactome pathway
US Patent
n/an/a 1n/an/an/an/a7.5n/a
Boehringer Ingelheim International GmbH
US Patent
Assay Description
This test uses active PTK2 enzyme (Invitrogen Code PV3832) and poly-Glu-Tyr (4:1, Sigma P-0275) as the kinase substrate. The kinase activity is detec...
US Patent US8846689 (2014)
BindingDB Entry DOI: 10.7270/Q2BC3X7Z