BDBM134509 US8846656, 21-N
SMILES: CO[C@@H]1CCN([C@H](C)C1)c1nc(nc2CCN(Cc12)c1cc(OC)ccc1C)-c1c(C)cccc1C
InChI Key: InChIKey=YMUCKLZYTFAEHI-ISKFKSNPSA-N
Data: 1 IC50
Activity Spreadsheet -- Enzyme Inhibition Constant Data from BindingDB
Found 1 hit for monomerid = 134509
Trg + Lig
Ki
nM
ΔG°
kcal/mole
IC50
nM
Kd
nM
EC50/IC50
nM
koff
s-1
kon
M-1s-1
pHTemp
°C
C5a anaphylatoxin chemotactic receptor (C5aR)
(Homo sapiens (Human))
BDBM134509
(US8846656, 21-N)
Show SMILES CO[C@@H]1CCN([C@H](C)C1)c1nc(nc2CCN(Cc12)c1cc(OC)ccc1C)-c1c(C)cccc1C |r|
Show InChI InChI=1S/C30H38N4O2/c1-19-10-11-23(35-5)17-27(19)33-14-13-26-25(18-33)30(34-15-12-24(36-6)16-22(34)4)32-29(31-26)28-20(2)8-7-9-21(28)3/h7-11,17,22,24H,12-16,18H2,1-6H3/t22-,24-/m1/s1
US Patent
n/an/a 2n/an/an/an/an/an/a
Novartis AG
US Patent
Assay Description
Compounds were tested for their ability to inhibit C5a-mediated calcium mobilization using a stable cell line over expressing the human C5aR & the Ga...
US Patent US8846656 (2014)
BindingDB Entry DOI: 10.7270/Q2JW8CKR