BDBM134588 US8846656, 65-H
SMILES: COC1CN(C[C@@H]1N(C)C)c1nc(nc2CCN(Cc12)c1cc(ccc1C)C(C)C)-c1c(C)ccc2[nH]nc(C)c12
InChI Key:
Data: 1 IC50
Activity Spreadsheet -- Enzyme Inhibition Constant Data from BindingDB
Found 1 hit for monomerid = 134588
Trg + Lig
Ki
nM
ΔG°
kcal/mole
IC50
nM
Kd
nM
EC50/IC50
nM
koff
s-1
kon
M-1s-1
pHTemp
°C
C5a anaphylatoxin chemotactic receptor (C5aR)
(Homo sapiens (Human))
BDBM134588
(US8846656, 65-H)
Show SMILES COC1CN(C[C@@H]1N(C)C)c1nc(nc2CCN(Cc12)c1cc(ccc1C)C(C)C)-c1c(C)ccc2[nH]nc(C)c12 |r|
US Patent
n/an/a 4n/an/an/an/an/an/a
Novartis AG
US Patent
Assay Description
Compounds were tested for their ability to inhibit C5a-mediated calcium mobilization using a stable cell line over expressing the human C5aR & the Ga...
US Patent US8846656 (2014)
BindingDB Entry DOI: 10.7270/Q2JW8CKR