BDBM134590 US8846656, 65-K
SMILES: CC(C)c1ccc(C)c(c1)N1CCc2nc(nc(N3CCOC[C@H]3C)c2C1)-c1c(C)ccc2[nH]nc(C)c12
InChI Key:
Data: 1 IC50
Activity Spreadsheet -- Enzyme Inhibition Constant Data from BindingDB
Found 1 hit for monomerid = 134590
Trg + Lig
Ki
nM
ΔG°
kcal/mole
IC50
nM
Kd
nM
EC50/IC50
nM
koff
s-1
kon
M-1s-1
pHTemp
°C
C5a anaphylatoxin chemotactic receptor 1
(Homo sapiens (Human))
BDBM134590
(US8846656, 65-K)
Show SMILES CC(C)c1ccc(C)c(c1)N1CCc2nc(nc(N3CCOC[C@H]3C)c2C1)-c1c(C)ccc2[nH]nc(C)c12 |r|
US Patent
n/an/a 2n/an/an/an/an/an/a
Novartis AG
US Patent
Assay Description
Compounds were tested for their ability to inhibit C5a-mediated calcium mobilization using a stable cell line over expressing the human C5aR & the Ga...
US Patent US8846656 (2014)
BindingDB Entry DOI: 10.7270/Q2JW8CKR