null
SMILES: COCC(C)(C)n1cc(C(=O)c2cncc(NC(=O)Cc3ccc(F)cc3)c2)c2cncnc12
InChI Key: InChIKey=KMUQRYMBHWRFOG-UHFFFAOYSA-N
Activity Spreadsheet -- Enzyme Inhibition Constant Data from BindingDB
Found 1 hit for monomerid = 135054
Trg + Lig
Ki
nM
ΔG°
kcal/mole
IC50
nM
Kd
nM
EC50/IC50
nM
koff
s-1
kon
M-1s-1
pHTemp
°C
High affinity nerve growth factor receptor
(Homo sapiens (Human))
BDBM135054
(US8846698, 539)
Show SMILES COCC(C)(C)n1cc(C(=O)c2cncc(NC(=O)Cc3ccc(F)cc3)c2)c2cncnc12
Show InChI InChI=1S/C25H24FN5O3/c1-25(2,14-34-3)31-13-21(20-12-28-15-29-24(20)31)23(33)17-9-19(11-27-10-17)30-22(32)8-16-4-6-18(26)7-5-16/h4-7,9-13,15H,8,14H2,1-3H3,(H,30,32)
US Patent
n/an/a 4.08n/an/an/an/an/an/a
Pfizer Limited
US Patent
Assay Description
Isolated TRK Enzyme assays use the HTRF KinEASE-TK kit (Cisbio Cat# 62TK0PEJ) with recombinant His-tagged cytoplasmic domains of each TRK receptor so...
US Patent US8846698 (2014)
BindingDB Entry DOI: 10.7270/Q2F47MTW