null
SMILES: CC(C)(CO)n1cc(C(=O)c2cncc(NC(=O)Cc3nc4ccccc4[nH]3)c2)c2cnc(N)nc12
InChI Key: InChIKey=QMTFKDCSGZCJML-UHFFFAOYSA-N
Activity Spreadsheet -- Enzyme Inhibition Constant Data from BindingDB
Found 1 hit for monomerid = 135071
Trg + Lig
Ki
nM
ΔG°
kcal/mole
IC50
nM
Kd
nM
EC50/IC50
nM
koff
s-1
kon
M-1s-1
pHTemp
°C
High affinity nerve growth factor receptor
(Homo sapiens (Human))
BDBM135071
(US8846698, 558)
Show SMILES CC(C)(CO)n1cc(C(=O)c2cncc(NC(=O)Cc3nc4ccccc4[nH]3)c2)c2cnc(N)nc12
Show InChI InChI=1S/C25H24N8O3/c1-25(2,13-34)33-12-17(16-11-28-24(26)32-23(16)33)22(36)14-7-15(10-27-9-14)29-21(35)8-20-30-18-5-3-4-6-19(18)31-20/h3-7,9-12,34H,8,13H2,1-2H3,(H,29,35)(H,30,31)(H2,26,28,32)
US Patent
n/an/a 5.56n/an/an/an/an/an/a
Pfizer Limited
US Patent
Assay Description
Isolated TRK Enzyme assays use the HTRF KinEASE-TK kit (Cisbio Cat# 62TK0PEJ) with recombinant His-tagged cytoplasmic domains of each TRK receptor so...
US Patent US8846698 (2014)
BindingDB Entry DOI: 10.7270/Q2F47MTW