BDBM13525 (3R)-4-[(3R)-3-amino-4-(2,4,5-trifluorophenyl)butanoyl]-3-(2,2,2-trifluoroethyl)-1,4-diazepan-2-one::Diazepanone Analog 1
SMILES: N[C@@H](CC(=O)N1CCCNC(=O)[C@H]1CC(F)(F)F)Cc1cc(F)c(F)cc1F
InChI Key: InChIKey=RMDAPSXWBVPVOG-QMTHXVAHSA-N
Data: 3 IC50
PDB links: 1 PDB ID matches this monomer.
Activity Spreadsheet -- Enzyme Inhibition Constant Data from BindingDB
Found 3 hits for monomerid = 13525
Trg + Lig
Ki
nM
ΔG°
kcal/mole
IC50
nM
Kd
nM
EC50/IC50
nM
koff
s-1
kon
M-1s-1
pHTemp
°C
Dipeptidyl peptidase 4
(Homo sapiens (Human))
BDBM13525
((3R)-4-[(3R)-3-amino-4-(2,4,5-trifluorophenyl)buta...)
Show SMILES N[C@@H](CC(=O)N1CCCNC(=O)[C@H]1CC(F)(F)F)Cc1cc(F)c(F)cc1F |r|
Show InChI InChI=1S/C17H19F6N3O2/c18-11-7-13(20)12(19)5-9(11)4-10(24)6-15(27)26-3-1-2-25-16(28)14(26)8-17(21,22)23/h5,7,10,14H,1-4,6,8,24H2,(H,25,28)/t10-,14-/m1/s1
Reactome pathway
n/an/a 2.60n/an/an/an/a7.537
Merck Research Laboratories
Assay Description
The enzyme activity resulted in the formation of the fluorescent product amidomethylcoumarin (AMC), which was monitored by excitation at 360 nm and m...
Bioorg Med Chem Lett 17: 49-52 (2007)
Article DOI: 10.1016/j.bmcl.2006.09.099
BindingDB Entry DOI: 10.7270/Q2F47MC2
3D
3D Structure (crystal)
Dipeptidyl peptidase VIII
(Homo sapiens (Human))
BDBM13525
((3R)-4-[(3R)-3-amino-4-(2,4,5-trifluorophenyl)buta...)
Show SMILES N[C@@H](CC(=O)N1CCCNC(=O)[C@H]1CC(F)(F)F)Cc1cc(F)c(F)cc1F |r|
Show InChI InChI=1S/C17H19F6N3O2/c18-11-7-13(20)12(19)5-9(11)4-10(24)6-15(27)26-3-1-2-25-16(28)14(26)8-17(21,22)23/h5,7,10,14H,1-4,6,8,24H2,(H,25,28)/t10-,14-/m1/s1
n/an/a 2.80E+4n/an/an/an/an/an/a
Merck Research Laboratories
Assay Description
The enzyme activity resulted in the formation of the fluorescent product amidomethylcoumarin (AMC), which was monitored by excitation at 360 nm and m...
Bioorg Med Chem Lett 17: 49-52 (2007)
Article DOI: 10.1016/j.bmcl.2006.09.099
BindingDB Entry DOI: 10.7270/Q2F47MC2
Dipeptidyl peptidase 2 (DPP II)
(Homo sapiens (Human))
BDBM13525
((3R)-4-[(3R)-3-amino-4-(2,4,5-trifluorophenyl)buta...)
Show SMILES N[C@@H](CC(=O)N1CCCNC(=O)[C@H]1CC(F)(F)F)Cc1cc(F)c(F)cc1F |r|
Show InChI InChI=1S/C17H19F6N3O2/c18-11-7-13(20)12(19)5-9(11)4-10(24)6-15(27)26-3-1-2-25-16(28)14(26)8-17(21,22)23/h5,7,10,14H,1-4,6,8,24H2,(H,25,28)/t10-,14-/m1/s1
n/an/a 5.90E+4n/an/an/an/an/an/a
Merck Research Laboratories
Assay Description
The enzyme activity resulted in the formation of the fluorescent product amidomethylcoumarin (AMC), which was monitored by excitation at 360 nm and m...
Bioorg Med Chem Lett 17: 49-52 (2007)
Article DOI: 10.1016/j.bmcl.2006.09.099
BindingDB Entry DOI: 10.7270/Q2F47MC2