BDBM135495 US8853258, 107
SMILES: C[C@@](CCc1ccc(cc1)-c1ccc(cc1)C#N)(C(=O)NO)S(C)(=O)=O
InChI Key: InChIKey=YWHOFPDGCOTMNB-LJQANCHMSA-N
Data: 1 IC50
Activity Spreadsheet -- Enzyme Inhibition Constant Data from BindingDB
Found 1 hit for monomerid = 135495
Trg + Lig
Ki
nM
ΔG°
kcal/mole
IC50
nM
Kd
nM
EC50/IC50
nM
koff
s-1
kon
M-1s-1
pHTemp
°C
UDP-3-O-acyl-N-acetylglucosamine deacetylase
(Pseudomonas aeruginosa)
BDBM135495
(US8853258, 107)
Show SMILES C[C@@](CCc1ccc(cc1)-c1ccc(cc1)C#N)(C(=O)NO)S(C)(=O)=O
Show InChI InChI=1S/C19H20N2O4S/c1-19(18(22)21-23,26(2,24)25)12-11-14-3-7-16(8-4-14)17-9-5-15(13-20)6-10-17/h3-10,23H,11-12H2,1-2H3,(H,21,22)/t19-/m1/s1
US Patent
n/an/a 0.134n/an/an/an/a8.0n/a
Pfizer Inc.
US Patent
Assay Description
IC50 determination in the LpxC enzyme assay was carried out in a similar manner to that described by Malikzay et al in the 2006 Poster, Screening Lpx...
US Patent US8853258 (2014)
BindingDB Entry DOI: 10.7270/Q25M64DP