BDBM135498 US8853258, 113
SMILES: CC(CCc1ccc(cc1)-c1ccc(OCCO)cc1)(C(=O)NO)S(C)(=O)=O
InChI Key: InChIKey=WKJPZZKLGZCWCF-UHFFFAOYSA-N
Data: 1 IC50
Activity Spreadsheet -- Enzyme Inhibition Constant Data from BindingDB
Found 1 hit for monomerid = 135498
Trg + Lig
Ki
nM
ΔG°
kcal/mole
IC50
nM
Kd
nM
EC50/IC50
nM
koff
s-1
kon
M-1s-1
pHTemp
°C
UDP-3-O-acyl-N-acetylglucosamine deacetylase
(Pseudomonas aeruginosa)
BDBM135498
(US8853258, 113)
Show SMILES CC(CCc1ccc(cc1)-c1ccc(OCCO)cc1)(C(=O)NO)S(C)(=O)=O
Show InChI InChI=1S/C20H25NO6S/c1-20(19(23)21-24,28(2,25)26)12-11-15-3-5-16(6-4-15)17-7-9-18(10-8-17)27-14-13-22/h3-10,22,24H,11-14H2,1-2H3,(H,21,23)
US Patent
n/an/a 0.148n/an/an/an/a8.0n/a
Pfizer Inc.
US Patent
Assay Description
IC50 determination in the LpxC enzyme assay was carried out in a similar manner to that described by Malikzay et al in the 2006 Poster, Screening Lpx...
US Patent US8853258 (2014)
BindingDB Entry DOI: 10.7270/Q25M64DP