null
SMILES: CCOc1cc(OC2CCOCC2)cc(c1)C(Nc1ccc(cc1)C(N)=N)C(O)=O
InChI Key: InChIKey=CVVVPWCOCJSPHV-UHFFFAOYSA-N
Activity Spreadsheet -- Enzyme Inhibition Constant Data from BindingDB
Found 4 hits for monomerid = 13559
Trg + Lig
Ki
nM
ΔG°
kcal/mole
IC50
nM
Kd
nM
EC50/IC50
nM
koff
s-1
kon
M-1s-1
pHTemp
°C
Coagulation factor VII
(Homo sapiens (Human))
BDBM13559
(2-[(4-carbamimidoylphenyl)amino]-2-[3-ethoxy-5-(ox...)
Show SMILES CCOc1cc(OC2CCOCC2)cc(c1)C(Nc1ccc(cc1)C(N)=N)C(O)=O
Show InChI InChI=1S/C22H27N3O5/c1-2-29-18-11-15(12-19(13-18)30-17-7-9-28-10-8-17)20(22(26)27)25-16-5-3-14(4-6-16)21(23)24/h3-6,11-13,17,20,25H,2,7-10H2,1H3,(H3,23,24)(H,26,27)
Reactome pathway
140 -9.25n/an/an/an/an/a7.822
F. Hoffmann-La Roche Ltd.
Assay Description
The enzyme reactions were initiated by the addition of substrate, and the color developed from the release of p-nitroanilide from each chromogenic su...
Bioorg Med Chem Lett 15: 5344-52 (2005)
Article DOI: 10.1016/j.bmcl.2005.04.079
BindingDB Entry DOI: 10.7270/Q2X63K6X
Serine protease 1
(Bos taurus (bovine))
BDBM13559
(2-[(4-carbamimidoylphenyl)amino]-2-[3-ethoxy-5-(ox...)
Show SMILES CCOc1cc(OC2CCOCC2)cc(c1)C(Nc1ccc(cc1)C(N)=N)C(O)=O
Show InChI InChI=1S/C22H27N3O5/c1-2-29-18-11-15(12-19(13-18)30-17-7-9-28-10-8-17)20(22(26)27)25-16-5-3-14(4-6-16)21(23)24/h3-6,11-13,17,20,25H,2,7-10H2,1H3,(H3,23,24)(H,26,27)
7.00E+3n/an/an/an/an/an/an/an/a
F. Hoffmann-La Roche Ltd.
Assay Description
The enzyme reactions were initiated by the addition of substrate, and the color developed from the release of p-nitroanilide from each chromogenic su...
Bioorg Med Chem Lett 15: 5344-52 (2005)
Article DOI: 10.1016/j.bmcl.2005.04.079
BindingDB Entry DOI: 10.7270/Q2X63K6X
Coagulation factor X
(Homo sapiens (Human))
BDBM13559
(2-[(4-carbamimidoylphenyl)amino]-2-[3-ethoxy-5-(ox...)
Show SMILES CCOc1cc(OC2CCOCC2)cc(c1)C(Nc1ccc(cc1)C(N)=N)C(O)=O
Show InChI InChI=1S/C22H27N3O5/c1-2-29-18-11-15(12-19(13-18)30-17-7-9-28-10-8-17)20(22(26)27)25-16-5-3-14(4-6-16)21(23)24/h3-6,11-13,17,20,25H,2,7-10H2,1H3,(H3,23,24)(H,26,27)
Reactome pathway
2.90E+3n/an/an/an/an/an/an/an/a
F. Hoffmann-La Roche Ltd.
Assay Description
The enzyme reactions were initiated by the addition of substrate, and the color developed from the release of p-nitroanilide from each chromogenic su...
Bioorg Med Chem Lett 15: 5344-52 (2005)
Article DOI: 10.1016/j.bmcl.2005.04.079
BindingDB Entry DOI: 10.7270/Q2X63K6X
Prothrombin
(Homo sapiens (Human))
BDBM13559
(2-[(4-carbamimidoylphenyl)amino]-2-[3-ethoxy-5-(ox...)
Show SMILES CCOc1cc(OC2CCOCC2)cc(c1)C(Nc1ccc(cc1)C(N)=N)C(O)=O
Show InChI InChI=1S/C22H27N3O5/c1-2-29-18-11-15(12-19(13-18)30-17-7-9-28-10-8-17)20(22(26)27)25-16-5-3-14(4-6-16)21(23)24/h3-6,11-13,17,20,25H,2,7-10H2,1H3,(H3,23,24)(H,26,27)
>6.60E+3n/an/an/an/an/an/an/an/a
F. Hoffmann-La Roche Ltd.
Assay Description
The enzyme reactions were initiated by the addition of substrate, and the color developed from the release of p-nitroanilide from each chromogenic su...
Bioorg Med Chem Lett 15: 5344-52 (2005)
Article DOI: 10.1016/j.bmcl.2005.04.079
BindingDB Entry DOI: 10.7270/Q2X63K6X