BDBM135788 US8853242, 160
SMILES: [#7]\[#6](-[#7])=[#7]\[#6](=O)-c1ccc2c(F)cnc(-c3ccccc3F)c2c1
InChI Key: InChIKey=OXFIPEQRZBXKMG-UHFFFAOYSA-N
Data: 1 KI
Activity Spreadsheet -- Enzyme Inhibition Constant Data from BindingDB
Found 1 hit for monomerid = 135788
Trg + Lig
Ki
nM
ΔG°
kcal/mole
IC50
nM
Kd
nM
EC50/IC50
nM
koff
s-1
kon
M-1s-1
pHTemp
°C
5-hydroxytryptamine receptor 5A
(Homo sapiens (Human))
BDBM135788
(US8853242, 160)
Show SMILES [#7]\[#6](-[#7])=[#7]\[#6](=O)-c1ccc2c(F)cnc(-c3ccccc3F)c2c1
Show InChI InChI=1S/C17H12F2N4O/c18-13-4-2-1-3-11(13)15-12-7-9(16(24)23-17(20)21)5-6-10(12)14(19)8-22-15/h1-8H,(H4,20,21,23,24)
US Patent
3.30 -11.6n/an/an/an/an/a7.525
Astellas Pharma Inc.
US Patent
Assay Description
A solution of the compound to be tested and 100 μM 5-CT (5-carboxamidetriptamine) in DMSO was added to a 96-well plate at 2 μl/well, suspen...
US Patent US8853242 (2014)
BindingDB Entry DOI: 10.7270/Q2NP2346