BDBM135886 US8859596, 174
SMILES: CC(C)(C)NOc1ccc(cc1C(=O)\N=c1/sc(nn1CCCCF)C(C)(C)C)C(F)(F)F
InChI Key: InChIKey=WWNIOABTLLDVED-DIBXZPPDSA-N
Data: 2 KI
Activity Spreadsheet -- Enzyme Inhibition Constant Data from BindingDB
Found 2 hits for monomerid = 135886
Trg + Lig
Ki
nM
ΔG°
kcal/mole
IC50
nM
Kd
nM
EC50/IC50
nM
koff
s-1
kon
M-1s-1
pHTemp
°C
Cannabinoid receptor 2
(Rattus norvegicus (Rat))
BDBM135886
(US8859596, 174)
Show SMILES CC(C)(C)NOc1ccc(cc1C(=O)\N=c1/sc(nn1CCCCF)C(C)(C)C)C(F)(F)F
Show InChI InChI=1S/C22H30F4N4O2S/c1-20(2,3)18-28-30(12-8-7-11-23)19(33-18)27-17(31)15-13-14(22(24,25)26)9-10-16(15)32-29-21(4,5)6/h9-10,13,29H,7-8,11-12H2,1-6H3/b27-19-
US Patent
1.10n/an/an/an/an/an/a7.4n/a
AbbVie Inc.
US Patent
Assay Description
HEK293 cells stably expressing rat CB2 receptors were grown until a confluent monolayer was formed. Briefly, the cells were harvested and homogenized...
US Patent US8859596 (2014)
BindingDB Entry DOI: 10.7270/Q2W66JHC
Cannabinoid receptor 2
(Homo sapiens (Human))
BDBM135886
(US8859596, 174)
Show SMILES CC(C)(C)NOc1ccc(cc1C(=O)\N=c1/sc(nn1CCCCF)C(C)(C)C)C(F)(F)F
Show InChI InChI=1S/C22H30F4N4O2S/c1-20(2,3)18-28-30(12-8-7-11-23)19(33-18)27-17(31)15-13-14(22(24,25)26)9-10-16(15)32-29-21(4,5)6/h9-10,13,29H,7-8,11-12H2,1-6H3/b27-19-
Reactome pathway
US Patent
6.20 -11.4n/an/an/an/an/a7.430
AbbVie Inc.
US Patent
Assay Description
HEK293 cells stably expressing human CB2 receptors were grown until a confluent monolayer was formed. Briefly, the cells were harvested and homogeniz...
US Patent US8859596 (2014)
BindingDB Entry DOI: 10.7270/Q2W66JHC