BDBM13626 3-Oxybenzamide 12::3-[2-(4-aminophenyl)ethoxy]-4-chloro-N-{[1-(pyridin-4-yl)piperidin-4-yl]methyl}benzamide
SMILES: Nc1ccc(CCOc2cc(ccc2Cl)C(=O)NCC2CCN(CC2)c2ccncc2)cc1
InChI Key: InChIKey=CVUVHSMJDWAULJ-UHFFFAOYSA-N
Data: 3 KI
Activity Spreadsheet -- Enzyme Inhibition Constant Data from BindingDB
Found 3 hits for monomerid = 13626
Trg + Lig
Ki
nM
ΔG°
kcal/mole
IC50
nM
Kd
nM
EC50/IC50
nM
koff
s-1
kon
M-1s-1
pHTemp
°C
Coagulation factor X
(Homo sapiens (Human))
BDBM13626
(3-Oxybenzamide 12 | 3-[2-(4-aminophenyl)ethoxy]-4-...)
Show SMILES Nc1ccc(CCOc2cc(ccc2Cl)C(=O)NCC2CCN(CC2)c2ccncc2)cc1
Show InChI InChI=1S/C26H29ClN4O2/c27-24-6-3-21(17-25(24)33-16-11-19-1-4-22(28)5-2-19)26(32)30-18-20-9-14-31(15-10-20)23-7-12-29-13-8-23/h1-8,12-13,17,20H,9-11,14-16,18,28H2,(H,30,32)
Reactome pathway
398n/an/an/an/an/an/an/an/a
Rheinische Friedrich-Wilhelms-Universita£t
Curated by ChEMBL
Assay Description
Inhibition of human factor 10a
J Med Chem 54: 2944-51 (2011)
Article DOI: 10.1021/jm200026b
BindingDB Entry DOI: 10.7270/Q2ZG6TGM
Coagulation factor X
(Homo sapiens (Human))
BDBM13626
(3-Oxybenzamide 12 | 3-[2-(4-aminophenyl)ethoxy]-4-...)
Show SMILES Nc1ccc(CCOc2cc(ccc2Cl)C(=O)NCC2CCN(CC2)c2ccncc2)cc1
Show InChI InChI=1S/C26H29ClN4O2/c27-24-6-3-21(17-25(24)33-16-11-19-1-4-22(28)5-2-19)26(32)30-18-20-9-14-31(15-10-20)23-7-12-29-13-8-23/h1-8,12-13,17,20H,9-11,14-16,18,28H2,(H,30,32)
Reactome pathway
420n/an/an/an/an/an/an/an/a
Aventis Pharma Deutschland GmbH
Curated by ChEMBL
Assay Description
Inhibitory activity against human Coagulation factor X
Bioorg Med Chem Lett 14: 2801-5 (2004)
Article DOI: 10.1016/j.bmcl.2004.03.059
BindingDB Entry DOI: 10.7270/Q2XS5WW7
Coagulation factor X
(Homo sapiens (Human))
BDBM13626
(3-Oxybenzamide 12 | 3-[2-(4-aminophenyl)ethoxy]-4-...)
Show SMILES Nc1ccc(CCOc2cc(ccc2Cl)C(=O)NCC2CCN(CC2)c2ccncc2)cc1
Show InChI InChI=1S/C26H29ClN4O2/c27-24-6-3-21(17-25(24)33-16-11-19-1-4-22(28)5-2-19)26(32)30-18-20-9-14-31(15-10-20)23-7-12-29-13-8-23/h1-8,12-13,17,20H,9-11,14-16,18,28H2,(H,30,32)
Reactome pathway
420 -8.69n/an/an/an/an/a7.825
Aventis Pharma Deutschland GmbH
Assay Description
The inhibitory effect of test compound for human fXa was determined by using the chromogenic substrates S-2765. The hydrolysis rates of chromogenic s...
J Med Chem 48: 3290-312 (2005)
Article DOI: 10.1021/jm049187l
BindingDB Entry DOI: 10.7270/Q28C9THZ