BDBM136275 US8853193, 32-5
SMILES: Cc1c(sc2ncnc(Nc3ccc(F)cc3OCC3CC3(F)F)c12)C(O)=O
InChI Key: InChIKey=CPJIRVFQLCYFMG-UHFFFAOYSA-N
Data: 1 IC50
Activity Spreadsheet -- Enzyme Inhibition Constant Data from BindingDB
Found 1 hit for monomerid = 136275
Trg + Lig
Ki
nM
ΔG°
kcal/mole
IC50
nM
Kd
nM
EC50/IC50
nM
koff
s-1
kon
M-1s-1
pHTemp
°C
MAP kinase-interacting serine/threonine-protein kinase 2
(Homo sapiens (Human))
BDBM136275
(US8853193, 32-5)
Show SMILES Cc1c(sc2ncnc(Nc3ccc(F)cc3OCC3CC3(F)F)c12)C(O)=O
Show InChI InChI=1S/C18H14F3N3O3S/c1-8-13-15(22-7-23-16(13)28-14(8)17(25)26)24-11-3-2-10(19)4-12(11)27-6-9-5-18(9,20)21/h2-4,7,9H,5-6H2,1H3,(H,25,26)(H,22,23,24)
US Patent
n/an/a 8n/an/an/an/a7.430
Boehringer Ingelheim International GmbH
US Patent
Assay Description
Inhibition of kinase activity of Mnk1 and Mnk2a was assessed with the same assay system, using pre-activated GST-Mnk1 or GST-Mnk2a, respectively. The...
US Patent US8853193 (2014)
BindingDB Entry DOI: 10.7270/Q2GX4983