BDBM136326 US8859534, 12
SMILES: CNC(=O)c1cc2cccc(N3CCN(CCc4ccccn4)CC3)c2o1
InChI Key: InChIKey=FMLPGGANFIDSPV-UHFFFAOYSA-N
Data: 2 KI
Activity Spreadsheet -- Enzyme Inhibition Constant Data from BindingDB
Found 2 hits for monomerid = 136326
Trg + Lig
Ki
nM
ΔG°
kcal/mole
IC50
nM
Kd
nM
EC50/IC50
nM
koff
s-1
kon
M-1s-1
pHTemp
°C
5-hydroxytryptamine receptor 1A (5HT1A)
(Cricetulus griseus (Chinese hamster) (Cricetulus b...)
BDBM136326
(US8859534, 12)
Show SMILES CNC(=O)c1cc2cccc(N3CCN(CCc4ccccn4)CC3)c2o1
Show InChI InChI=1S/C21H24N4O2/c1-22-21(26)19-15-16-5-4-7-18(20(16)27-19)25-13-11-24(12-14-25)10-8-17-6-2-3-9-23-17/h2-7,9,15H,8,10-14H2,1H3,(H,22,26)
US Patent
0.110n/an/an/an/an/an/a7.4n/a
Acturum Life Science AB
US Patent
Assay Description
Assays that were used to measure affinity of the compounds of the present invention for 5-HT1A and 5-HT1B receptors are described in J. Recept Signal...
US Patent US8859534 (2014)
BindingDB Entry DOI: 10.7270/Q23R0RKV
5-hydroxytryptamine receptor 1B (5HT1B)
(Cricetulus griseus (Chinese hamster) (Cricetulus b...)
BDBM136326
(US8859534, 12)
Show SMILES CNC(=O)c1cc2cccc(N3CCN(CCc4ccccn4)CC3)c2o1
Show InChI InChI=1S/C21H24N4O2/c1-22-21(26)19-15-16-5-4-7-18(20(16)27-19)25-13-11-24(12-14-25)10-8-17-6-2-3-9-23-17/h2-7,9,15H,8,10-14H2,1H3,(H,22,26)
US Patent
0.880n/an/an/an/an/an/a7.4n/a
Acturum Life Science AB
US Patent
Assay Description
Assays that were used to measure affinity of the compounds of the present invention for 5-HT1A and 5-HT1B receptors are described in J. Recept Signal...
US Patent US8859534 (2014)
BindingDB Entry DOI: 10.7270/Q23R0RKV