BDBM136351 US8859534, 37
SMILES: Oc1cccc(CNC(=O)c2cc3cccc(N4CCN(CCc5ccccn5)CC4)c3o2)c1
InChI Key: InChIKey=PAQCZDXYXLCTFI-UHFFFAOYSA-N
Data: 2 KI
Activity Spreadsheet -- Enzyme Inhibition Constant Data from BindingDB
Found 2 hits for monomerid = 136351
Trg + Lig
Ki
nM
ΔG°
kcal/mole
IC50
nM
Kd
nM
EC50/IC50
nM
koff
s-1
kon
M-1s-1
pHTemp
°C
5-hydroxytryptamine receptor 1A (5HT1A)
(Cricetulus griseus (Chinese hamster) (Cricetulus b...)
BDBM136351
(US8859534, 37)
Show SMILES Oc1cccc(CNC(=O)c2cc3cccc(N4CCN(CCc5ccccn5)CC4)c3o2)c1
Show InChI InChI=1S/C27H28N4O3/c32-23-8-3-5-20(17-23)19-29-27(33)25-18-21-6-4-9-24(26(21)34-25)31-15-13-30(14-16-31)12-10-22-7-1-2-11-28-22/h1-9,11,17-18,32H,10,12-16,19H2,(H,29,33)
US Patent
0.230n/an/an/an/an/an/a7.4n/a
Acturum Life Science AB
US Patent
Assay Description
Assays that were used to measure affinity of the compounds of the present invention for 5-HT1A and 5-HT1B receptors are described in J. Recept Signal...
US Patent US8859534 (2014)
BindingDB Entry DOI: 10.7270/Q23R0RKV
5-hydroxytryptamine receptor 1B (5HT1B)
(Cricetulus griseus (Chinese hamster) (Cricetulus b...)
BDBM136351
(US8859534, 37)
Show SMILES Oc1cccc(CNC(=O)c2cc3cccc(N4CCN(CCc5ccccn5)CC4)c3o2)c1
Show InChI InChI=1S/C27H28N4O3/c32-23-8-3-5-20(17-23)19-29-27(33)25-18-21-6-4-9-24(26(21)34-25)31-15-13-30(14-16-31)12-10-22-7-1-2-11-28-22/h1-9,11,17-18,32H,10,12-16,19H2,(H,29,33)
US Patent
3.5n/an/an/an/an/an/a7.4n/a
Acturum Life Science AB
US Patent
Assay Description
Assays that were used to measure affinity of the compounds of the present invention for 5-HT1A and 5-HT1B receptors are described in J. Recept Signal...
US Patent US8859534 (2014)
BindingDB Entry DOI: 10.7270/Q23R0RKV