BDBM136514 US8865714, 1
SMILES: Cn1cccc1C(=O)N1CCN(CC1)C(=O)Nc1ccc(cc1)N1CCC(O)CC1
InChI Key: InChIKey=MCIXIOJTXYAIBD-UHFFFAOYSA-N
Data: 1 IC50
Activity Spreadsheet -- Enzyme Inhibition Constant Data from BindingDB
Found 1 hit for monomerid = 136514
Trg + Lig
Ki
nM
ΔG°
kcal/mole
IC50
nM
Kd
nM
EC50/IC50
nM
koff
s-1
kon
M-1s-1
pHTemp
°C
Prostaglandin D Synthase
(Homo sapiens (Human))
BDBM136514
(US8865714, 1)
Show SMILES Cn1cccc1C(=O)N1CCN(CC1)C(=O)Nc1ccc(cc1)N1CCC(O)CC1
Show InChI InChI=1S/C22H29N5O3/c1-24-10-2-3-20(24)21(29)26-13-15-27(16-14-26)22(30)23-17-4-6-18(7-5-17)25-11-8-19(28)9-12-25/h2-7,10,19,28H,8-9,11-16H2,1H3,(H,23,30)
Reactome pathway
US Patent
n/an/a 58n/an/an/an/a8.025
Taiho Pharmaceutical Co., Ltd.
US Patent
Assay Description
The test was carried out according to the method of Urade, Y. et al. (J. Biol. Chem., 262, 3820-3825, (1987)). More specifically, the reaction mixtur...
US Patent US8865714 (2014)
BindingDB Entry DOI: 10.7270/Q2QF8RKC