BDBM136519 US8865714, 6
SMILES: Cn1cccc1C(=O)N1CCN(CC1)C(=O)Nc1ccc(cc1)N1CCC(CCN2CCOCC2)CC1
InChI Key: InChIKey=XYSYJYTWKAIUAF-UHFFFAOYSA-N
Data: 1 IC50
Activity Spreadsheet -- Enzyme Inhibition Constant Data from BindingDB
Found 1 hit for monomerid = 136519
Trg + Lig
Ki
nM
ΔG°
kcal/mole
IC50
nM
Kd
nM
EC50/IC50
nM
koff
s-1
kon
M-1s-1
pHTemp
°C
Prostaglandin D Synthase
(Homo sapiens (Human))
BDBM136519
(US8865714, 6)
Show SMILES Cn1cccc1C(=O)N1CCN(CC1)C(=O)Nc1ccc(cc1)N1CCC(CCN2CCOCC2)CC1
Show InChI InChI=1S/C28H40N6O3/c1-30-11-2-3-26(30)27(35)33-15-17-34(18-16-33)28(36)29-24-4-6-25(7-5-24)32-13-9-23(10-14-32)8-12-31-19-21-37-22-20-31/h2-7,11,23H,8-10,12-22H2,1H3,(H,29,36)
Reactome pathway
US Patent
n/an/a 43n/an/an/an/a8.025
Taiho Pharmaceutical Co., Ltd.
US Patent
Assay Description
The test was carried out according to the method of Urade, Y. et al. (J. Biol. Chem., 262, 3820-3825, (1987)). More specifically, the reaction mixtur...
US Patent US8865714 (2014)
BindingDB Entry DOI: 10.7270/Q2QF8RKC