BDBM137037 US8871790, 103
SMILES: COC(=O)N1CCc2nc([nH]c2C1)-c1cc(ccc1C)C(=O)N1CCC(CC1)c1ccc(cc1)C#N
InChI Key: InChIKey=VPVIGBRHCHUUPL-UHFFFAOYSA-N
Data: 1 IC50
Activity Spreadsheet -- Enzyme Inhibition Constant Data from BindingDB
Found 1 hit for monomerid = 137037
Trg + Lig
Ki
nM
ΔG°
kcal/mole
IC50
nM
Kd
nM
EC50/IC50
nM
koff
s-1
kon
M-1s-1
pHTemp
°C
Fatty acid synthase
(Homo sapiens (Human))
BDBM137037
(US8871790, 103)
Show SMILES COC(=O)N1CCc2nc([nH]c2C1)-c1cc(ccc1C)C(=O)N1CCC(CC1)c1ccc(cc1)C#N
Show InChI InChI=1S/C28H29N5O3/c1-18-3-6-22(15-23(18)26-30-24-11-14-33(28(35)36-2)17-25(24)31-26)27(34)32-12-9-21(10-13-32)20-7-4-19(16-29)5-8-20/h3-8,15,21H,9-14,17H2,1-2H3,(H,30,31)
US Patent
n/an/a 35n/an/an/an/an/an/a
3-V Biosciences, Inc.
US Patent
Assay Description
The FASN enzyme was isolated from SKBr3 cells. SKBr3 is a human breast cancer cell-line with high levels of FASN expression. It is estimated that FAS...
US Patent US8871790 (2014)
BindingDB Entry DOI: 10.7270/Q2PG1QD3