BDBM137239 US8871790, 318
SMILES: Cc1ccc(cc1NC(=O)NC1CCOC1)C(=O)N1CCC(F)(CC1)c1ccc(cc1)C#N
InChI Key: InChIKey=BJVNNHKPPNXCSJ-UHFFFAOYSA-N
Data: 1 IC50
Activity Spreadsheet -- Enzyme Inhibition Constant Data from BindingDB
Found 1 hit for monomerid = 137239
Trg + Lig
Ki
nM
ΔG°
kcal/mole
IC50
nM
Kd
nM
EC50/IC50
nM
koff
s-1
kon
M-1s-1
pHTemp
°C
Fatty acid synthase
(Homo sapiens (Human))
BDBM137239
(US8871790, 318)
Show SMILES Cc1ccc(cc1NC(=O)NC1CCOC1)C(=O)N1CCC(F)(CC1)c1ccc(cc1)C#N
Show InChI InChI=1S/C25H27FN4O3/c1-17-2-5-19(14-22(17)29-24(32)28-21-8-13-33-16-21)23(31)30-11-9-25(26,10-12-30)20-6-3-18(15-27)4-7-20/h2-7,14,21H,8-13,16H2,1H3,(H2,28,29,32)
US Patent
n/an/a 37n/an/an/an/an/an/a
3-V Biosciences, Inc.
US Patent
Assay Description
The FASN enzyme was isolated from SKBr3 cells. SKBr3 is a human breast cancer cell-line with high levels of FASN expression. It is estimated that FAS...
US Patent US8871790 (2014)
BindingDB Entry DOI: 10.7270/Q2PG1QD3