BDBM137334 US8871790, 420
SMILES: COC(=O)N1CCc2nc([nH]c2C1)-c1cc(ccc1C1CCC1)C(=O)N1CCC(F)(CC1)c1ccc(cc1)C#N
InChI Key: InChIKey=FHQVCDFJKIZSNR-UHFFFAOYSA-N
Data: 1 IC50
Activity Spreadsheet -- Enzyme Inhibition Constant Data from BindingDB
Found 1 hit for monomerid = 137334
Trg + Lig
Ki
nM
ΔG°
kcal/mole
IC50
nM
Kd
nM
EC50/IC50
nM
koff
s-1
kon
M-1s-1
pHTemp
°C
Fatty acid synthase
(Homo sapiens (Human))
BDBM137334
(US8871790, 420)
Show SMILES COC(=O)N1CCc2nc([nH]c2C1)-c1cc(ccc1C1CCC1)C(=O)N1CCC(F)(CC1)c1ccc(cc1)C#N
Show InChI InChI=1S/C31H32FN5O3/c1-40-30(39)37-14-11-26-27(19-37)35-28(34-26)25-17-22(7-10-24(25)21-3-2-4-21)29(38)36-15-12-31(32,13-16-36)23-8-5-20(18-33)6-9-23/h5-10,17,21H,2-4,11-16,19H2,1H3,(H,34,35)
US Patent
n/an/a 20n/an/an/an/an/an/a
3-V Biosciences, Inc.
US Patent
Assay Description
The FASN enzyme was isolated from SKBr3 cells. SKBr3 is a human breast cancer cell-line with high levels of FASN expression. It is estimated that FAS...
US Patent US8871790 (2014)
BindingDB Entry DOI: 10.7270/Q2PG1QD3