BDBM137347 US8871790, 433
SMILES: CC(C)N1CCc2nc([nH]c2C1)-c1cc(C(=O)N2CCC(CC2)c2ccc(cc2)C#N)c(C)cc1C1CC1
InChI Key: InChIKey=KBKOINPRFFYKFM-UHFFFAOYSA-N
Data: 1 IC50
Activity Spreadsheet -- Enzyme Inhibition Constant Data from BindingDB
Found 1 hit for monomerid = 137347
Trg + Lig
Ki
nM
ΔG°
kcal/mole
IC50
nM
Kd
nM
EC50/IC50
nM
koff
s-1
kon
M-1s-1
pHTemp
°C
Fatty acid synthase
(Homo sapiens (Human))
BDBM137347
(US8871790, 433)
Show SMILES CC(C)N1CCc2nc([nH]c2C1)-c1cc(C(=O)N2CCC(CC2)c2ccc(cc2)C#N)c(C)cc1C1CC1
Show InChI InChI=1S/C32H37N5O/c1-20(2)37-15-12-29-30(19-37)35-31(34-29)28-17-26(21(3)16-27(28)25-8-9-25)32(38)36-13-10-24(11-14-36)23-6-4-22(18-33)5-7-23/h4-7,16-17,20,24-25H,8-15,19H2,1-3H3,(H,34,35)
US Patent
n/an/a 40n/an/an/an/an/an/a
3-V Biosciences, Inc.
US Patent
Assay Description
The FASN enzyme was isolated from SKBr3 cells. SKBr3 is a human breast cancer cell-line with high levels of FASN expression. It is estimated that FAS...
US Patent US8871790 (2014)
BindingDB Entry DOI: 10.7270/Q2PG1QD3