BDBM13797 3-{[2-(3-aminopiperidin-1-yl)-6-methyl-7-oxo-1H,6H,7H-imidazo[4,5-d]pyridazin-1-yl]methyl}benzonitrile::Xanthine mimetic compound 12
SMILES: Cn1ncc2nc(N3CCCC(N)C3)n(Cc3cccc(c3)C#N)c2c1=O
InChI Key: InChIKey=ZIGLAIZHAHOOFA-UHFFFAOYSA-N
Data: 1 KI
Activity Spreadsheet -- Enzyme Inhibition Constant Data from BindingDB
Found 1 hit for monomerid = 13797
Trg + Lig
Ki
nM
ΔG°
kcal/mole
IC50
nM
Kd
nM
EC50/IC50
nM
koff
s-1
kon
M-1s-1
pHTemp
°C
Dipeptidyl peptidase 4
(Homo sapiens (Human))
BDBM13797
(3-{[2-(3-aminopiperidin-1-yl)-6-methyl-7-oxo-1H,6H...)
Show SMILES Cn1ncc2nc(N3CCCC(N)C3)n(Cc3cccc(c3)C#N)c2c1=O
Show InChI InChI=1S/C19H21N7O/c1-24-18(27)17-16(10-22-24)23-19(25-7-3-6-15(21)12-25)26(17)11-14-5-2-4-13(8-14)9-20/h2,4-5,8,10,15H,3,6-7,11-12,21H2,1H3
Reactome pathway
1.20E+3 -7.99n/an/an/an/an/a7.522
Abbott Laboratories
Assay Description
The DPP activity resulted in the formation of the fluorescent product amidomethylcoumarin (AMC), which was monitored by excitation at 355 nm and meas...
Bioorg Med Chem Lett 16: 6226-30 (2006)
Article DOI: 10.1016/j.bmcl.2006.09.024
BindingDB Entry DOI: 10.7270/Q2MP51H4