BDBM138119 US8871783, 5
SMILES: CN1C(=O)Cc2ccc(cc12)-c1ccc(C[C@H](NC(=O)[C@H]2N[C@@H]3CC[C@H]2C3)C#N)o1
InChI Key: InChIKey=COMYBTSVTZPJEO-GEYWLOKFSA-N
Data: 1 KI
Activity Spreadsheet -- Enzyme Inhibition Constant Data from BindingDB
Found 1 hit for monomerid = 138119
Trg + Lig
Ki
nM
ΔG°
kcal/mole
IC50
nM
Kd
nM
EC50/IC50
nM
koff
s-1
kon
M-1s-1
pHTemp
°C
Dipeptidyl peptidase I
(Homo sapiens (Human))
BDBM138119
(US8871783, 5)
Show SMILES CN1C(=O)Cc2ccc(cc12)-c1ccc(C[C@H](NC(=O)[C@H]2N[C@@H]3CC[C@H]2C3)C#N)o1 |r|
Show InChI InChI=1S/C23H24N4O3/c1-27-19-9-14(3-2-13(19)10-21(27)28)20-7-6-18(30-20)11-17(12-24)26-23(29)22-15-4-5-16(8-15)25-22/h2-3,6-7,9,15-17,22,25H,4-5,8,10-11H2,1H3,(H,26,29)/t15-,16+,17-,22-/m0/s1
US Patent
177 -9.21n/an/an/an/an/a6.025
Boehringer Ingelheim International GmBh
US Patent
Assay Description
The following buffers were used: MES buffer: 25 mM MES, 50 mM NaCl, 5 mM DTT, adjusted to pH 6.0, containing 0.1% BSA; TAGZyme Buffer: 20 mM NaH2PO4,...
US Patent US8871783 (2014)
BindingDB Entry DOI: 10.7270/Q2F18XF1