BDBM138767 US8877741, 2.93
SMILES: C[C@H](NC(=O)c1cn[nH]c1)c1ccc(OC2CCN(C2)c2ccc(OC[C@H]3CC3(F)F)cn2)cc1
InChI Key:
Data: 1 IC50
Activity Spreadsheet -- Enzyme Inhibition Constant Data from BindingDB
Found 1 hit for monomerid = 138767
Trg + Lig
Ki
nM
ΔG°
kcal/mole
IC50
nM
Kd
nM
EC50/IC50
nM
koff
s-1
kon
M-1s-1
pHTemp
°C
Acetyl-CoA carboxylase 2 (ACC2)
(Homo sapiens (Human))
BDBM138767
(US8877741, 2.93)
Show SMILES C[C@H](NC(=O)c1cn[nH]c1)c1ccc(OC2CCN(C2)c2ccc(OC[C@H]3CC3(F)F)cn2)cc1 |r|
Reactome pathway
US Patent
n/an/a 40n/an/an/an/a7.5n/a
Boehringer Ingelheim International GmbH
US Patent
Assay Description
Malonyl CoA formation by acetyl CoA carboxylases is stoichometrically linked to the consumption of ATP. ACC2 activity is measured in a NADH-linked ki...
US Patent US8877741 (2014)
BindingDB Entry DOI: 10.7270/Q2R78CXJ