BDBM139027 US8884017, 58
SMILES: Fc1cccc2cc(sc12)C(=O)N[C@H]1CN2CCC1CC2
InChI Key: InChIKey=JLAFOFXKTDQTAV-ZDUSSCGKSA-N
Data: 1 KI
Activity Spreadsheet -- Enzyme Inhibition Constant Data from BindingDB
Found 1 hit for monomerid = 139027
Trg + Lig
Ki
nM
ΔG°
kcal/mole
IC50
nM
Kd
nM
EC50/IC50
nM
koff
s-1
kon
M-1s-1
pHTemp
°C
Neuronal acetylcholine receptor protein alpha-7 subunit
(Homo sapiens (Human))
BDBM139027
(US8884017, 58)
Show SMILES Fc1cccc2cc(sc12)C(=O)N[C@H]1CN2CCC1CC2 |r,wU:13.14,(5.71,-.87,;4.94,.47,;5.71,1.8,;4.94,3.13,;3.4,3.13,;2.63,1.8,;1.12,1.48,;.96,-.05,;2.37,-.68,;3.4,.47,;-.37,-.82,;-.37,-2.36,;-1.71,-.05,;-3.04,-.82,;-3.04,-2.36,;-4.37,-3.13,;-5.71,-2.36,;-5.71,-.82,;-4.37,-.05,;-3.6,-1.39,;-5.14,-1.8,)|
Show InChI InChI=1S/C16H17FN2OS/c17-12-3-1-2-11-8-14(21-15(11)12)16(20)18-13-9-19-6-4-10(13)5-7-19/h1-3,8,10,13H,4-7,9H2,(H,18,20)/t13-/m0/s1
US Patent
3.10 -10.8n/an/an/an/an/a7.44
Bayer Intellectual Property GmbH
US Patent
Assay Description
The [3H]-methyllycaconitine binding assay is a modification of the method described by Davies et al. in Neuropharmacol. 1999, 38, 679-690.Rat brain t...
US Patent US8884017 (2014)
BindingDB Entry DOI: 10.7270/Q2MK6BK3