BDBM139030 US8884017, 64
SMILES: FC(F)(F)c1cccc2cc(sc12)C(=O)N[C@H]1CN2CCC1CC2
InChI Key: InChIKey=SWHCZXSYRFCFJJ-ZDUSSCGKSA-N
Data: 1 KI
Activity Spreadsheet -- Enzyme Inhibition Constant Data from BindingDB
Found 1 hit for monomerid = 139030
Trg + Lig
Ki
nM
ΔG°
kcal/mole
IC50
nM
Kd
nM
EC50/IC50
nM
koff
s-1
kon
M-1s-1
pHTemp
°C
Neuronal acetylcholine receptor protein alpha-7 subunit
(Homo sapiens (Human))
BDBM139030
(US8884017, 64)
Show SMILES FC(F)(F)c1cccc2cc(sc12)C(=O)N[C@H]1CN2CCC1CC2 |r,wU:16.17,(5.81,-2.2,;5.04,-.87,;3.71,-1.64,;6.37,-.1,;4.27,.47,;5.04,1.8,;4.27,3.13,;2.73,3.13,;1.96,1.8,;.45,1.48,;.29,-.05,;1.7,-.68,;2.73,.47,;-1.04,-.82,;-1.04,-2.36,;-2.37,-.05,;-3.71,-.82,;-3.71,-2.36,;-5.04,-3.13,;-6.37,-2.36,;-6.37,-.82,;-5.04,-.05,;-4.27,-1.39,;-5.81,-1.8,)|
Show InChI InChI=1S/C17H17F3N2OS/c18-17(19,20)12-3-1-2-11-8-14(24-15(11)12)16(23)21-13-9-22-6-4-10(13)5-7-22/h1-3,8,10,13H,4-7,9H2,(H,21,23)/t13-/m0/s1
US Patent
20 -9.76n/an/an/an/an/a7.44
Bayer Intellectual Property GmbH
US Patent
Assay Description
The [3H]-methyllycaconitine binding assay is a modification of the method described by Davies et al. in Neuropharmacol. 1999, 38, 679-690.Rat brain t...
US Patent US8884017 (2014)
BindingDB Entry DOI: 10.7270/Q2MK6BK3