null
SMILES: CCc1c(CC(O)=O)cn2ncnc(Nc3ccc4n(Cc5ccccc5)ncc4c3)c12
InChI Key: InChIKey=NFCDGHRKDYRHJM-UHFFFAOYSA-N
Activity Spreadsheet -- Enzyme Inhibition Constant Data from BindingDB
Found 4 hits for monomerid = 13920
Trg + Lig
Ki
nM
ΔG°
kcal/mole
IC50
nM
Kd
nM
EC50/IC50
nM
koff
s-1
kon
M-1s-1
pHTemp
°C
Receptor tyrosine-protein kinase erbB-2
(Homo sapiens (Human))
BDBM13920
(2-{4-[(1-benzyl-1H-indazol-5-yl)amino]-5-ethylpyrr...)
Show SMILES CCc1c(CC(O)=O)cn2ncnc(Nc3ccc4n(Cc5ccccc5)ncc4c3)c12
Show InChI InChI=1S/C24H22N6O2/c1-2-20-18(11-22(31)32)14-30-23(20)24(25-15-27-30)28-19-8-9-21-17(10-19)12-26-29(21)13-16-6-4-3-5-7-16/h3-10,12,14-15H,2,11,13H2,1H3,(H,31,32)(H,25,27,28)
n/an/a 680n/an/an/an/an/an/a
Bristol-Myers Squibb Pharmaceutical Research Institute
Curated by ChEMBL
Assay Description
The kinase activity was determined by using recombinant enzyme incubating with its substrate in the presence of test compound and ATP/[gamma-33P] ATP...
Bioorg Med Chem Lett 15: 4774-9 (2005)
Article DOI: 10.1016/j.bmcl.2005.07.027
BindingDB Entry DOI: 10.7270/Q2XD1172
Epidermal growth factor receptor
(Homo sapiens (Human))
BDBM13920
(2-{4-[(1-benzyl-1H-indazol-5-yl)amino]-5-ethylpyrr...)
Show SMILES CCc1c(CC(O)=O)cn2ncnc(Nc3ccc4n(Cc5ccccc5)ncc4c3)c12
Show InChI InChI=1S/C24H22N6O2/c1-2-20-18(11-22(31)32)14-30-23(20)24(25-15-27-30)28-19-8-9-21-17(10-19)12-26-29(21)13-16-6-4-3-5-7-16/h3-10,12,14-15H,2,11,13H2,1H3,(H,31,32)(H,25,27,28)
n/an/a 1.60E+3n/an/an/an/an/an/a
Bristol-Myers Squibb Pharmaceutical Research Institute
Curated by ChEMBL
Assay Description
In vitro inhibitory concentration against EGFR cytoplasmic sequence expressed in Sf9 cells
Bioorg Med Chem Lett 15: 4774-9 (2005)
Article DOI: 10.1016/j.bmcl.2005.07.027
BindingDB Entry DOI: 10.7270/Q2XD1172
Receptor tyrosine-protein kinase erbB-2
(Homo sapiens (Human))
BDBM13920
(2-{4-[(1-benzyl-1H-indazol-5-yl)amino]-5-ethylpyrr...)
Show SMILES CCc1c(CC(O)=O)cn2ncnc(Nc3ccc4n(Cc5ccccc5)ncc4c3)c12
Show InChI InChI=1S/C24H22N6O2/c1-2-20-18(11-22(31)32)14-30-23(20)24(25-15-27-30)28-19-8-9-21-17(10-19)12-26-29(21)13-16-6-4-3-5-7-16/h3-10,12,14-15H,2,11,13H2,1H3,(H,31,32)(H,25,27,28)
n/an/a 680n/an/an/an/an/an/a
Bristol-Myers Squibb Pharmaceutical Research Institute
Curated by ChEMBL
Assay Description
In vitro inhibitory concentration against HER2 cytoplasmic sequence expressed in Sf9 cells
Bioorg Med Chem Lett 15: 4774-9 (2005)
Article DOI: 10.1016/j.bmcl.2005.07.027
BindingDB Entry DOI: 10.7270/Q2XD1172
Epidermal growth factor receptor
(Homo sapiens (Human))
BDBM13920
(2-{4-[(1-benzyl-1H-indazol-5-yl)amino]-5-ethylpyrr...)
Show SMILES CCc1c(CC(O)=O)cn2ncnc(Nc3ccc4n(Cc5ccccc5)ncc4c3)c12
Show InChI InChI=1S/C24H22N6O2/c1-2-20-18(11-22(31)32)14-30-23(20)24(25-15-27-30)28-19-8-9-21-17(10-19)12-26-29(21)13-16-6-4-3-5-7-16/h3-10,12,14-15H,2,11,13H2,1H3,(H,31,32)(H,25,27,28)
n/an/a 1.60E+3n/an/an/an/an/an/a
Bristol-Myers Squibb Pharmaceutical Research Institute
Curated by ChEMBL
Assay Description
The kinase activity was determined by using recombinant enzyme incubating with its substrate in the presence of test compound and ATP/[gamma-33P] ATP...
Bioorg Med Chem Lett 15: 4774-9 (2005)
Article DOI: 10.1016/j.bmcl.2005.07.027
BindingDB Entry DOI: 10.7270/Q2XD1172