BDBM139614 US8889870, 162::US9388176, 162::US9820989, 162
SMILES: FC(F)(F)c1cccc(c1)C(=O)Nc1ccc(cc1)N1CCc2ccncc2C1
InChI Key: InChIKey=GPILFGJABMRGLK-UHFFFAOYSA-N
Data: 2 KI  4 IC50
Activity Spreadsheet -- Enzyme Inhibition Constant Data from BindingDB
Found 6 hits for monomerid = 139614
Trg + Lig
Ki
nM
ΔG°
kcal/mole
IC50
nM
Kd
nM
EC50/IC50
nM
koff
s-1
kon
M-1s-1
pHTemp
°C
Vascular endothelial growth factor receptor 2
(Homo sapiens (Human))
BDBM139614
(US8889870, 162 | US9388176, 162 | US9820989, 162)
Show SMILES FC(F)(F)c1cccc(c1)C(=O)Nc1ccc(cc1)N1CCc2ccncc2C1
Show InChI InChI=1S/C22H18F3N3O/c23-22(24,25)18-3-1-2-16(12-18)21(29)27-19-4-6-20(7-5-19)28-11-9-15-8-10-26-13-17(15)14-28/h1-8,10,12-13H,9,11,14H2,(H,27,29)
NCI pathway
Reactome pathway
US Patent
>1.00E+4n/an/an/an/an/an/an/an/a
ALLERGAN, INC.
US Patent
Assay Description
Biochemical KDR kinase assays were performed in 96 well microliter plates that were coated overnight with 75 μg/well of poly-Glu-Tyr (4:1) in 10...
US Patent US9820989 (2017)
BindingDB Entry DOI: 10.7270/Q2TT4T6G
Platelet-derived growth factor receptor beta
(Homo sapiens (Human))
BDBM139614
(US8889870, 162 | US9388176, 162 | US9820989, 162)
Show SMILES FC(F)(F)c1cccc(c1)C(=O)Nc1ccc(cc1)N1CCc2ccncc2C1
Show InChI InChI=1S/C22H18F3N3O/c23-22(24,25)18-3-1-2-16(12-18)21(29)27-19-4-6-20(7-5-19)28-11-9-15-8-10-26-13-17(15)14-28/h1-8,10,12-13H,9,11,14H2,(H,27,29)
NCI pathway
Reactome pathway
US Patent
>1.00E+4n/an/an/an/an/an/an/an/a
ALLERGAN, INC.
US Patent
Assay Description
Biochemical PDGFRβ kinase assays were performed in 96 well microliter plates that were coated overnight with 75 μg of poly-Glu-Tyr (4:1) in...
US Patent US9820989 (2017)
BindingDB Entry DOI: 10.7270/Q2TT4T6G
Platelet-derived growth factor receptor beta
(Homo sapiens (Human))
BDBM139614
(US8889870, 162 | US9388176, 162 | US9820989, 162)
Show SMILES FC(F)(F)c1cccc(c1)C(=O)Nc1ccc(cc1)N1CCc2ccncc2C1
Show InChI InChI=1S/C22H18F3N3O/c23-22(24,25)18-3-1-2-16(12-18)21(29)27-19-4-6-20(7-5-19)28-11-9-15-8-10-26-13-17(15)14-28/h1-8,10,12-13H,9,11,14H2,(H,27,29)
NCI pathway
Reactome pathway
US Patent
n/an/a>1.00E+4n/an/an/an/a7.430
ALLERGAN, INC.
US Patent
Assay Description
Biochemical PDGFRβ kinase assays were performed in 96 well microliter plates that were coated overnight with 75 μg of poly-Glu-Tyr (4:1) in 1...
US Patent US9388176 (2016)
BindingDB Entry DOI: 10.7270/Q2TQ60DZ
Platelet-derived growth factor receptor beta
(Homo sapiens (Human))
BDBM139614
(US8889870, 162 | US9388176, 162 | US9820989, 162)
Show SMILES FC(F)(F)c1cccc(c1)C(=O)Nc1ccc(cc1)N1CCc2ccncc2C1
Show InChI InChI=1S/C22H18F3N3O/c23-22(24,25)18-3-1-2-16(12-18)21(29)27-19-4-6-20(7-5-19)28-11-9-15-8-10-26-13-17(15)14-28/h1-8,10,12-13H,9,11,14H2,(H,27,29)
NCI pathway
Reactome pathway
US Patent
n/an/a>1.00E+4n/an/an/an/a7.4n/a
Allergan, Inc.
US Patent
Assay Description
Biochemical PDGFR.beta. kinase assays were performed in 96 well microtiter plates that were coated overnight with 75 .mu.g of poly-Glu-Tyr (4:1) in 1...
US Patent US8889870 (2014)
BindingDB Entry DOI: 10.7270/Q25B0158
Vascular endothelial growth factor receptor 2
(Homo sapiens (Human))
BDBM139614
(US8889870, 162 | US9388176, 162 | US9820989, 162)
Show SMILES FC(F)(F)c1cccc(c1)C(=O)Nc1ccc(cc1)N1CCc2ccncc2C1
Show InChI InChI=1S/C22H18F3N3O/c23-22(24,25)18-3-1-2-16(12-18)21(29)27-19-4-6-20(7-5-19)28-11-9-15-8-10-26-13-17(15)14-28/h1-8,10,12-13H,9,11,14H2,(H,27,29)
NCI pathway
Reactome pathway
US Patent
n/an/a>1.00E+4n/an/an/an/a7.4n/a
Allergan, Inc.
US Patent
Assay Description
Biochemical KDR kinase assays were performed in 96 well microliter plates that were coated overnight with 75 .mu.g/well of poly-Glu-Tyr (4:1) in 10 m...
US Patent US8889870 (2014)
BindingDB Entry DOI: 10.7270/Q25B0158
Vascular endothelial growth factor receptor 2
(Homo sapiens (Human))
BDBM139614
(US8889870, 162 | US9388176, 162 | US9820989, 162)
Show SMILES FC(F)(F)c1cccc(c1)C(=O)Nc1ccc(cc1)N1CCc2ccncc2C1
Show InChI InChI=1S/C22H18F3N3O/c23-22(24,25)18-3-1-2-16(12-18)21(29)27-19-4-6-20(7-5-19)28-11-9-15-8-10-26-13-17(15)14-28/h1-8,10,12-13H,9,11,14H2,(H,27,29)
NCI pathway
Reactome pathway
US Patent
n/an/a>1.00E+4n/an/an/an/a7.430
ALLERGAN, INC.
US Patent
Assay Description
Biochemical KDR kinase assays were performed in 96 well microliter plates that were coated overnight with 75 μg/well of poly-Glu-Tyr (4:1) in 10 m...
US Patent US9388176 (2016)
BindingDB Entry DOI: 10.7270/Q2TQ60DZ