BDBM140075 US8901315, 141
SMILES: Cc1nn(C2CCCCC2)c2sc(cc12)C(=O)Nc1ccc(cc1)C1CCNCC1
InChI Key: InChIKey=XAXSQUSHSMQZLJ-UHFFFAOYSA-N
Data: 2 IC50
Activity Spreadsheet -- Enzyme Inhibition Constant Data from BindingDB
Found 2 hits for monomerid = 140075
Trg + Lig
Ki
nM
ΔG°
kcal/mole
IC50
nM
Kd
nM
EC50/IC50
nM
koff
s-1
kon
M-1s-1
pHTemp
°C
Phosphodiesterase
(Mus musculus (Mouse))
BDBM140075
(US8901315, 141)
Show SMILES Cc1nn(C2CCCCC2)c2sc(cc12)C(=O)Nc1ccc(cc1)C1CCNCC1
Show InChI InChI=1S/C24H30N4OS/c1-16-21-15-22(30-24(21)28(27-16)20-5-3-2-4-6-20)23(29)26-19-9-7-17(8-10-19)18-11-13-25-14-12-18/h7-10,15,18,20,25H,2-6,11-14H2,1H3,(H,26,29)
US Patent
n/an/a 1.60E+3n/an/an/an/a6.54
Daiichi Sankyo Company, Limited
US Patent
Assay Description
The PDE 4 (phosphodiesterase IV) inhibiting effect of the compounds of the present invention was performed by the following method, which was modifie...
US Patent US8901315 (2014)
BindingDB Entry DOI: 10.7270/Q2GM860P
High affinity cAMP-specific 3',5'-cyclic phosphodiesterase 7A
(Homo sapiens (Human))
BDBM140075
(US8901315, 141)
Show SMILES Cc1nn(C2CCCCC2)c2sc(cc12)C(=O)Nc1ccc(cc1)C1CCNCC1
Show InChI InChI=1S/C24H30N4OS/c1-16-21-15-22(30-24(21)28(27-16)20-5-3-2-4-6-20)23(29)26-19-9-7-17(8-10-19)18-11-13-25-14-12-18/h7-10,15,18,20,25H,2-6,11-14H2,1H3,(H,26,29)
Reactome pathway
US Patent
n/an/a 22n/an/an/an/a7.54
Daiichi Sankyo Company, Limited
US Patent
Assay Description
The PDE 7 (phosphodiesterase VII) inhibiting effect of the compounds of the present invention was performed by the following method, which was modifi...
US Patent US8901315 (2014)
BindingDB Entry DOI: 10.7270/Q2GM860P