BDBM140285 US8912173, 11
SMILES: COc1cc(ccc1O)-c1cc(O[C@H](C)[C@H]2CNC(=O)C2)c2cccnc2c1
InChI Key: InChIKey=NWOAQTKDTOSKFT-CZUORRHYSA-N
Data: 1 IC50
Activity Spreadsheet -- Enzyme Inhibition Constant Data from BindingDB
Found 1 hit for monomerid = 140285
Trg + Lig
Ki
nM
ΔG°
kcal/mole
IC50
nM
Kd
nM
EC50/IC50
nM
koff
s-1
kon
M-1s-1
pHTemp
°C
Tyrosine-protein kinase SYK
(Homo sapiens (Human))
BDBM140285
(US8912173, 11)
Show SMILES COc1cc(ccc1O)-c1cc(O[C@H](C)[C@H]2CNC(=O)C2)c2cccnc2c1 |r|
Show InChI InChI=1S/C22H22N2O4/c1-13(16-11-22(26)24-12-16)28-20-10-15(8-18-17(20)4-3-7-23-18)14-5-6-19(25)21(9-14)27-2/h3-10,13,16,25H,11-12H2,1-2H3,(H,24,26)/t13-,16-/m1/s1
NCI pathway
Reactome pathway
US Patent
n/an/a 0.600n/an/an/an/a7.5-80
Boehringer Ingelheim International GmbH
US Patent
Assay Description
Recombinant human Syk (amino acids 342-635) was expressed as a fusion protein with an N-terminal GST tag, affinity-purified and deep-frozen at a conc...
US Patent US8912173 (2014)
BindingDB Entry DOI: 10.7270/Q2TX3D3T