BDBM140295 US8912173, 21
SMILES: COc1ccc(cn1)-c1cc(O[C@H](C)[C@H]2CNC(=O)C2)c2cccnc2c1
InChI Key: InChIKey=BAZFJAUFOQVQGK-CZUORRHYSA-N
Data: 1 IC50
Activity Spreadsheet -- Enzyme Inhibition Constant Data from BindingDB
Found 1 hit for monomerid = 140295
Trg + Lig
Ki
nM
ΔG°
kcal/mole
IC50
nM
Kd
nM
EC50/IC50
nM
koff
s-1
kon
M-1s-1
pHTemp
°C
Tyrosine-protein kinase SYK
(Homo sapiens (Human))
BDBM140295
(US8912173, 21)
Show SMILES COc1ccc(cn1)-c1cc(O[C@H](C)[C@H]2CNC(=O)C2)c2cccnc2c1 |r|
Show InChI InChI=1S/C21H21N3O3/c1-13(16-10-20(25)23-12-16)27-19-9-15(8-18-17(19)4-3-7-22-18)14-5-6-21(26-2)24-11-14/h3-9,11,13,16H,10,12H2,1-2H3,(H,23,25)/t13-,16-/m1/s1
NCI pathway
Reactome pathway
US Patent
n/an/a 0.900n/an/an/an/a7.5-80
Boehringer Ingelheim International GmbH
US Patent
Assay Description
Recombinant human Syk (amino acids 342-635) was expressed as a fusion protein with an N-terminal GST tag, affinity-purified and deep-frozen at a conc...
US Patent US8912173 (2014)
BindingDB Entry DOI: 10.7270/Q2TX3D3T