BDBM140299 US8912173, 25
SMILES: COc1ccc(cc1OC)-c1cc(OCc2ncccc2C(N)=O)c2cccnc2c1
InChI Key: InChIKey=YPLGAXLOFMRMBR-UHFFFAOYSA-N
Data: 1 IC50
Activity Spreadsheet -- Enzyme Inhibition Constant Data from BindingDB
Found 1 hit for monomerid = 140299
Trg + Lig
Ki
nM
ΔG°
kcal/mole
IC50
nM
Kd
nM
EC50/IC50
nM
koff
s-1
kon
M-1s-1
pHTemp
°C
Tyrosine-protein kinase SYK
(Homo sapiens (Human))
BDBM140299
(US8912173, 25)
Show SMILES COc1ccc(cc1OC)-c1cc(OCc2ncccc2C(N)=O)c2cccnc2c1
Show InChI InChI=1S/C24H21N3O4/c1-29-21-8-7-15(12-23(21)30-2)16-11-19-17(5-3-9-26-19)22(13-16)31-14-20-18(24(25)28)6-4-10-27-20/h3-13H,14H2,1-2H3,(H2,25,28)
NCI pathway
Reactome pathway
US Patent
n/an/a 0.600n/an/an/an/a7.5-80
Boehringer Ingelheim International GmbH
US Patent
Assay Description
Recombinant human Syk (amino acids 342-635) was expressed as a fusion protein with an N-terminal GST tag, affinity-purified and deep-frozen at a conc...
US Patent US8912173 (2014)
BindingDB Entry DOI: 10.7270/Q2TX3D3T