BDBM14033 4-{1-ethyl-6-methoxy-1H-imidazo[4,5-c]pyridin-2-yl}-1,2,5-oxadiazol-3-amine::Aminofurazanyl-azabenzimidazole 6a
SMILES: CCn1c(nc2cnc(OC)cc12)-c1nonc1N
InChI Key: InChIKey=XIIWSNNMSSTCNO-UHFFFAOYSA-N
Data: 1 IC50
Activity Spreadsheet -- Enzyme Inhibition Constant Data from BindingDB
Found 1 hit for monomerid = 14033
Trg + Lig
Ki
nM
ΔG°
kcal/mole
IC50
nM
Kd
nM
EC50/IC50
nM
koff
s-1
kon
M-1s-1
pHTemp
°C
Rho-associated protein kinase 1
(Homo sapiens (Human))
BDBM14033
(4-{1-ethyl-6-methoxy-1H-imidazo[4,5-c]pyridin-2-yl...)
Show SMILES CCn1c(nc2cnc(OC)cc12)-c1nonc1N
Show InChI InChI=1S/C11H12N6O2/c1-3-17-7-4-8(18-2)13-5-6(7)14-11(17)9-10(12)16-19-15-9/h4-5H,3H2,1-2H3,(H2,12,16)
NCI pathway
Reactome pathway
n/an/a 4.40n/an/an/an/a7.422
GlaxoSmithKline
Assay Description
The assay of Rock-1 activity involved incubation with peptide substrate and ATP/[gamma-33P] ATP, the subsequent incorporation of 33P into the peptid...
J Med Chem 50: 2-5 (2007)
Article DOI: 10.1021/jm060873p
BindingDB Entry DOI: 10.7270/Q2F18WZB