BDBM14041 Aminofurazanyl-azabenzimidazole 6h::N-(3-{[2-(4-amino-1,2,5-oxadiazol-3-yl)-1-ethyl-1H-imidazo[4,5-c]pyridin-6-yl]oxy}phenyl)-4-(dimethylamino)benzamide
SMILES: CCn1c(nc2cnc(Oc3cccc(NC(=O)c4ccc(cc4)N(C)C)c3)cc12)-c1nonc1N
InChI Key: InChIKey=KODFUVBIVXFWPF-UHFFFAOYSA-N
Data: 1 IC50
Activity Spreadsheet -- Enzyme Inhibition Constant Data from BindingDB
Found 1 hit for monomerid = 14041
Trg + Lig
Ki
nM
ΔG°
kcal/mole
IC50
nM
Kd
nM
EC50/IC50
nM
koff
s-1
kon
M-1s-1
pHTemp
°C
Rho-associated protein kinase 1
(Homo sapiens (Human))
BDBM14041
(Aminofurazanyl-azabenzimidazole 6h | N-(3-{[2-(4-a...)
Show SMILES CCn1c(nc2cnc(Oc3cccc(NC(=O)c4ccc(cc4)N(C)C)c3)cc12)-c1nonc1N
Show InChI InChI=1S/C25H24N8O3/c1-4-33-20-13-21(27-14-19(20)29-24(33)22-23(26)31-36-30-22)35-18-7-5-6-16(12-18)28-25(34)15-8-10-17(11-9-15)32(2)3/h5-14H,4H2,1-3H3,(H2,26,31)(H,28,34)
NCI pathway
Reactome pathway
n/an/a 2n/an/an/an/a7.422
GlaxoSmithKline
Assay Description
The assay of Rock-1 activity involved incubation with peptide substrate and ATP/[gamma-33P] ATP, the subsequent incorporation of 33P into the peptid...
J Med Chem 50: 2-5 (2007)
Article DOI: 10.1021/jm060873p
BindingDB Entry DOI: 10.7270/Q2F18WZB