BDBM14043 Aminofurazanyl-azabenzimidazole 6j::N-(3-{[2-(4-amino-1,2,5-oxadiazol-3-yl)-1-ethyl-1H-imidazo[4,5-c]pyridin-6-yl]oxy}phenyl)-4-(aminomethyl)benzamide
SMILES: CCn1c(nc2cnc(Oc3cccc(NC(=O)c4ccc(CN)cc4)c3)cc12)-c1nonc1N
InChI Key: InChIKey=GEUNAFQIZOWNSN-UHFFFAOYSA-N
Data: 1 IC50
Activity Spreadsheet -- Enzyme Inhibition Constant Data from BindingDB
Found 1 hit for monomerid = 14043
Trg + Lig
Ki
nM
ΔG°
kcal/mole
IC50
nM
Kd
nM
EC50/IC50
nM
koff
s-1
kon
M-1s-1
pHTemp
°C
Rho-associated protein kinase 1
(Homo sapiens (Human))
BDBM14043
(Aminofurazanyl-azabenzimidazole 6j | N-(3-{[2-(4-a...)
Show SMILES CCn1c(nc2cnc(Oc3cccc(NC(=O)c4ccc(CN)cc4)c3)cc12)-c1nonc1N
Show InChI InChI=1S/C24H22N8O3/c1-2-32-19-11-20(27-13-18(19)29-23(32)21-22(26)31-35-30-21)34-17-5-3-4-16(10-17)28-24(33)15-8-6-14(12-25)7-9-15/h3-11,13H,2,12,25H2,1H3,(H2,26,31)(H,28,33)
NCI pathway
Reactome pathway
n/an/a<1n/an/an/an/a7.422
GlaxoSmithKline
Assay Description
The assay of Rock-1 activity involved incubation with peptide substrate and ATP/[gamma-33P] ATP, the subsequent incorporation of 33P into the peptid...
J Med Chem 50: 2-5 (2007)
Article DOI: 10.1021/jm060873p
BindingDB Entry DOI: 10.7270/Q2F18WZB