BDBM14044 Aminofurazanyl-azabenzimidazole 6k::N-(3-{[2-(4-amino-1,2,5-oxadiazol-3-yl)-1-ethyl-1H-imidazo[4,5-c]pyridin-6-yl]oxy}phenyl)-4-[(dimethylamino)methyl]benzamide
SMILES: CCn1c(nc2cnc(Oc3cccc(NC(=O)c4ccc(CN(C)C)cc4)c3)cc12)-c1nonc1N
InChI Key: InChIKey=JMQZNOXDUCVFRY-UHFFFAOYSA-N
Data: 1 IC50
Activity Spreadsheet -- Enzyme Inhibition Constant Data from BindingDB
Found 1 hit for monomerid = 14044
Trg + Lig
Ki
nM
ΔG°
kcal/mole
IC50
nM
Kd
nM
EC50/IC50
nM
koff
s-1
kon
M-1s-1
pHTemp
°C
Rho-associated protein kinase 1
(Homo sapiens (Human))
BDBM14044
(Aminofurazanyl-azabenzimidazole 6k | N-(3-{[2-(4-a...)
Show SMILES CCn1c(nc2cnc(Oc3cccc(NC(=O)c4ccc(CN(C)C)cc4)c3)cc12)-c1nonc1N
Show InChI InChI=1S/C26H26N8O3/c1-4-34-21-13-22(28-14-20(21)30-25(34)23-24(27)32-37-31-23)36-19-7-5-6-18(12-19)29-26(35)17-10-8-16(9-11-17)15-33(2)3/h5-14H,4,15H2,1-3H3,(H2,27,32)(H,29,35)
NCI pathway
Reactome pathway
n/an/a<1n/an/an/an/a7.422
GlaxoSmithKline
Assay Description
The assay of Rock-1 activity involved incubation with peptide substrate and ATP/[gamma-33P] ATP, the subsequent incorporation of 33P into the peptid...
J Med Chem 50: 2-5 (2007)
Article DOI: 10.1021/jm060873p
BindingDB Entry DOI: 10.7270/Q2F18WZB