BDBM140534 US8912221, 7
SMILES: COC(=O)c1c(Cl)cccc1-c1ccc([C@@H](C)NC(=O)C2(COC2)NC(=O)c2cncnc2)c(F)c1
InChI Key: InChIKey=SRAVZAAZSZSOJS-CQSZACIVSA-N
Data: 1 KI
Activity Spreadsheet -- Enzyme Inhibition Constant Data from BindingDB
Found 1 hit for monomerid = 140534
Trg + Lig
Ki
nM
ΔG°
kcal/mole
IC50
nM
Kd
nM
EC50/IC50
nM
koff
s-1
kon
M-1s-1
pHTemp
°C
Bradykinin B1 receptor
(Homo sapiens (Human))
BDBM140534
(US8912221, 7)
Show SMILES COC(=O)c1c(Cl)cccc1-c1ccc([C@@H](C)NC(=O)C2(COC2)NC(=O)c2cncnc2)c(F)c1 |r|
Show InChI InChI=1S/C25H22ClFN4O5/c1-14(30-24(34)25(11-36-12-25)31-22(32)16-9-28-13-29-10-16)17-7-6-15(8-20(17)27)18-4-3-5-19(26)21(18)23(33)35-2/h3-10,13-14H,11-12H2,1-2H3,(H,30,34)(H,31,32)/t14-/m1/s1
US Patent
1.60n/an/an/an/an/an/a7.4n/a
Hoffmann-La Roche Inc.
US Patent
Assay Description
For binding, Bradykinin-1 receptor antagonist compounds were added in various concentrations in 50 mM Tris pH 7.4, 5 mM MgCl2 together with 6 nM Kall...
US Patent US8912221 (2014)
BindingDB Entry DOI: 10.7270/Q2668BWC