null
SMILES: COC(=O)c1c(Cl)cccc1-c1ccc([C@@H](C)NC(=O)C2(COC2)NC(=O)c2ccno2)c(F)c1
InChI Key: InChIKey=DTMIQGWAUKXLMT-CYBMUJFWSA-N
Activity Spreadsheet -- Enzyme Inhibition Constant Data from BindingDB
Found 1 hit for monomerid = 140539
Trg + Lig
Ki
nM
ΔG°
kcal/mole
IC50
nM
Kd
nM
EC50/IC50
nM
koff
s-1
kon
M-1s-1
pHTemp
°C
B1 bradykinin receptor
(Homo sapiens (Human))
BDBM140539
(US8912221, 12)
Show SMILES COC(=O)c1c(Cl)cccc1-c1ccc([C@@H](C)NC(=O)C2(COC2)NC(=O)c2ccno2)c(F)c1 |r|
Show InChI InChI=1S/C24H21ClFN3O6/c1-13(28-23(32)24(11-34-12-24)29-21(30)19-8-9-27-35-19)15-7-6-14(10-18(15)26)16-4-3-5-17(25)20(16)22(31)33-2/h3-10,13H,11-12H2,1-2H3,(H,28,32)(H,29,30)/t13-/m1/s1
US Patent
0.800n/an/an/an/an/an/a7.4n/a
Hoffmann-La Roche Inc.
US Patent
Assay Description
For binding, Bradykinin-1 receptor antagonist compounds were added in various concentrations in 50 mM Tris pH 7.4, 5 mM MgCl2 together with 6 nM Kall...
US Patent US8912221 (2014)
BindingDB Entry DOI: 10.7270/Q2668BWC