BDBM14074 (2S)-N-[1-(1,3-benzothiazol-2-yl)-5-carbamimidamido-1-oxopentan-2-yl]-1-(3,3-diphenylpropanoyl)pyrrolidine-2-carboxamide::2-ketobenzothiazole 14
SMILES: [#7]\[#6](-[#7])=[#7]\[#6]-[#6]-[#6]-[#6](-[#7]-[#6](=O)-[#6@@H]-1-[#6]-[#6]-[#6]-[#7]-1-[#6](=O)-[#6]-[#6](-c1ccccc1)-c1ccccc1)-[#6](=O)-c1nc2ccccc2s1
InChI Key: InChIKey=YRXHPMDKEZLJQE-GEVKEYJPSA-N
Data: 2 KI  1 IC50
Activity Spreadsheet -- Enzyme Inhibition Constant Data from BindingDB
Found 2 hits for monomerid = 14074
Trg + Lig
Ki
nM
ΔG°
kcal/mole
IC50
nM
Kd
nM
EC50/IC50
nM
koff
s-1
kon
M-1s-1
pHTemp
°C
Prothrombin
(Homo sapiens (Human))
BDBM14074
((2S)-N-[1-(1,3-benzothiazol-2-yl)-5-carbamimidamid...)
Show SMILES [#7]\[#6](-[#7])=[#7]\[#6]-[#6]-[#6]-[#6](-[#7]-[#6](=O)-[#6@@H]-1-[#6]-[#6]-[#6]-[#7]-1-[#6](=O)-[#6]-[#6](-c1ccccc1)-c1ccccc1)-[#6](=O)-c1nc2ccccc2s1 |r|
Show InChI InChI=1S/C33H36N6O3S/c34-33(35)36-19-9-16-26(30(41)32-38-25-15-7-8-18-28(25)43-32)37-31(42)27-17-10-20-39(27)29(40)21-24(22-11-3-1-4-12-22)23-13-5-2-6-14-23/h1-8,11-15,18,24,26-27H,9-10,16-17,19-21H2,(H,37,42)(H4,34,35,36)/t26?,27-/m0/s1
1.10 -12.7 11n/an/an/an/a7.437
Johnson & Johnson Pharmaceutical
Assay Description
Thrombin-catalyzed hydrolysis rates were measured spectrophotometrically using human alpha-thrombin, a chromogenic substrate in aqueous buffer, and a...
J Med Chem 48: 1984-2008 (2005)
Article DOI: 10.1021/jm0303857
BindingDB Entry DOI: 10.7270/Q2X0658X
Trypsin
(Bos taurus (bovine))
BDBM14074
((2S)-N-[1-(1,3-benzothiazol-2-yl)-5-carbamimidamid...)
Show SMILES [#7]\[#6](-[#7])=[#7]\[#6]-[#6]-[#6]-[#6](-[#7]-[#6](=O)-[#6@@H]-1-[#6]-[#6]-[#6]-[#7]-1-[#6](=O)-[#6]-[#6](-c1ccccc1)-c1ccccc1)-[#6](=O)-c1nc2ccccc2s1 |r|
Show InChI InChI=1S/C33H36N6O3S/c34-33(35)36-19-9-16-26(30(41)32-38-25-15-7-8-18-28(25)43-32)37-31(42)27-17-10-20-39(27)29(40)21-24(22-11-3-1-4-12-22)23-13-5-2-6-14-23/h1-8,11-15,18,24,26-27H,9-10,16-17,19-21H2,(H,37,42)(H4,34,35,36)/t26?,27-/m0/s1
22n/an/an/an/an/an/an/an/a
Johnson & Johnson Pharmaceutical
Assay Description
Trypsin-catalyzed hydrolysis rates were measured spectrophotometrically using bovine trypsin, a chromogenic substrate in aqueous buffer, and a microp...
J Med Chem 48: 1984-2008 (2005)
Article DOI: 10.1021/jm0303857
BindingDB Entry DOI: 10.7270/Q2X0658X