BDBM14085 (2S)-N-[1-(1,3-benzothiazol-2-yl)-5-carbamimidamido-1-oxopentan-2-yl]-3-methyl-2-[(2R)-2-(methylamino)-3-phenylpropanamido]butanamide::2-ketobenzothiazole 25
SMILES: [#6]-[#7]-[#6@H](-[#6]-c1ccccc1)-[#6](=O)-[#7]-[#6@@H](-[#6](-[#6])-[#6])-[#6](=O)-[#7]-[#6](-[#6]-[#6]-[#6]\[#7]=[#6](\[#7])-[#7])-[#6](=O)-c1nc2ccccc2s1
InChI Key: InChIKey=KRHCNQAFUSINQB-VBFAWGIDSA-N
Data: 2 KI  1 IC50
Activity Spreadsheet -- Enzyme Inhibition Constant Data from BindingDB
Found 2 hits for monomerid = 14085
Trg + Lig
Ki
nM
ΔG°
kcal/mole
IC50
nM
Kd
nM
EC50/IC50
nM
koff
s-1
kon
M-1s-1
pHTemp
°C
Trypsin
(Bos taurus (bovine))
BDBM14085
((2S)-N-[1-(1,3-benzothiazol-2-yl)-5-carbamimidamid...)
Show SMILES [#6]-[#7]-[#6@H](-[#6]-c1ccccc1)-[#6](=O)-[#7]-[#6@@H](-[#6](-[#6])-[#6])-[#6](=O)-[#7]-[#6](-[#6]-[#6]-[#6]\[#7]=[#6](\[#7])-[#7])-[#6](=O)-c1nc2ccccc2s1 |r|
Show InChI InChI=1S/C28H37N7O3S/c1-17(2)23(35-25(37)21(31-3)16-18-10-5-4-6-11-18)26(38)33-20(13-9-15-32-28(29)30)24(36)27-34-19-12-7-8-14-22(19)39-27/h4-8,10-12,14,17,20-21,23,31H,9,13,15-16H2,1-3H3,(H,33,38)(H,35,37)(H4,29,30,32)/t20?,21-,23+/m1/s1
1.5n/an/an/an/an/an/an/an/a
Johnson & Johnson Pharmaceutical
Assay Description
Trypsin-catalyzed hydrolysis rates were measured spectrophotometrically using bovine trypsin, a chromogenic substrate in aqueous buffer, and a microp...
J Med Chem 48: 1984-2008 (2005)
Article DOI: 10.1021/jm0303857
BindingDB Entry DOI: 10.7270/Q2X0658X
Prothrombin
(Homo sapiens (Human))
BDBM14085
((2S)-N-[1-(1,3-benzothiazol-2-yl)-5-carbamimidamid...)
Show SMILES [#6]-[#7]-[#6@H](-[#6]-c1ccccc1)-[#6](=O)-[#7]-[#6@@H](-[#6](-[#6])-[#6])-[#6](=O)-[#7]-[#6](-[#6]-[#6]-[#6]\[#7]=[#6](\[#7])-[#7])-[#6](=O)-c1nc2ccccc2s1 |r|
Show InChI InChI=1S/C28H37N7O3S/c1-17(2)23(35-25(37)21(31-3)16-18-10-5-4-6-11-18)26(38)33-20(13-9-15-32-28(29)30)24(36)27-34-19-12-7-8-14-22(19)39-27/h4-8,10-12,14,17,20-21,23,31H,9,13,15-16H2,1-3H3,(H,33,38)(H,35,37)(H4,29,30,32)/t20?,21-,23+/m1/s1
21n/a 440n/an/an/an/an/an/a
Johnson & Johnson Pharmaceutical
Assay Description
Thrombin-catalyzed hydrolysis rates were measured spectrophotometrically using human alpha-thrombin, a chromogenic substrate in aqueous buffer, and a...
J Med Chem 48: 1984-2008 (2005)
Article DOI: 10.1021/jm0303857
BindingDB Entry DOI: 10.7270/Q2X0658X