BDBM140959 US8916553, 217
SMILES: COc1cc(NS(C)(=O)=O)ccc1-c1cnccc1C
InChI Key: InChIKey=YNGOPNUFKFDECR-UHFFFAOYSA-N
Data: 1 IC50
Activity Spreadsheet -- Enzyme Inhibition Constant Data from BindingDB
Found 1 hit for monomerid = 140959
Trg + Lig
Ki
nM
ΔG°
kcal/mole
IC50
nM
Kd
nM
EC50/IC50
nM
koff
s-1
kon
M-1s-1
pHTemp
°C
Cytochrome P450 17A1
(Homo sapiens (Human))
BDBM140959
(US8916553, 217)
Show SMILES COc1cc(NS(C)(=O)=O)ccc1-c1cnccc1C
Show InChI InChI=1S/C14H16N2O3S/c1-10-6-7-15-9-13(10)12-5-4-11(8-14(12)19-2)16-20(3,17)18/h4-9,16H,1-3H3
Reactome pathway
US Patent
n/an/a 2.5n/an/an/an/a7.24
Bristol-Myers Squibb Company
US Patent
Assay Description
The assays were performed in U-bottom 384-well optiplates. The final assay volume was 15 ul prepared from 7.5 ul additions of microsomes (prepared as...
US Patent US8916553 (2014)
BindingDB Entry DOI: 10.7270/Q2XP73N9