BDBM141039 US8916576, 267
SMILES: Oc1ccc2nc(nc(Nc3ccc4[nH]ncc4c3)c2c1)-c1ccccc1
InChI Key: InChIKey=ABUYXWHKWYVATB-UHFFFAOYSA-N
Data: 1 IC50
Activity Spreadsheet -- Enzyme Inhibition Constant Data from BindingDB
Found 1 hit for monomerid = 141039
Trg + Lig
Ki
nM
ΔG°
kcal/mole
IC50
nM
Kd
nM
EC50/IC50
nM
koff
s-1
kon
M-1s-1
pHTemp
°C
Rho-associated protein kinase 2
(Homo sapiens (Human))
BDBM141039
(US8916576, 267)
Show SMILES Oc1ccc2nc(nc(Nc3ccc4[nH]ncc4c3)c2c1)-c1ccccc1
Show InChI InChI=1S/C21H15N5O/c27-16-7-9-19-17(11-16)21(25-20(24-19)13-4-2-1-3-5-13)23-15-6-8-18-14(10-15)12-22-26-18/h1-12,27H,(H,22,26)(H,23,24,25)
US Patent
n/an/a 3.90E+3n/an/an/an/an/an/a
Surface Logix, Inc.
US Patent
Assay Description
ROCK-II inhibitory activity can be measured using the ROCK-II Assay Kit (Molecular Devices, inc.; Sunnyvale, Calif.).
US Patent US8916576 (2014)
BindingDB Entry DOI: 10.7270/Q2P55M6K