BDBM141445 US10668051, Compound Example 122::US8921364, 122
SMILES: Fc1cccc(F)c1NC(=O)c1ccc(nc1)-n1nc(cc1C1CC1)C(F)(F)F
InChI Key: InChIKey=CEEWGQSGRMFCET-UHFFFAOYSA-N
Data: 2 IC50
Activity Spreadsheet -- Enzyme Inhibition Constant Data from BindingDB
Found 2 hits for monomerid = 141445
Trg + Lig
Ki
nM
ΔG°
kcal/mole
IC50
nM
Kd
nM
EC50/IC50
nM
koff
s-1
kon
M-1s-1
pHTemp
°C
Calcium release-activated calcium channel
(Homo sapiens (Human))
BDBM141445
(US10668051, Compound Example 122 | US8921364, 122)
Show SMILES Fc1cccc(F)c1NC(=O)c1ccc(nc1)-n1nc(cc1C1CC1)C(F)(F)F
Show InChI InChI=1S/C19H13F5N4O/c20-12-2-1-3-13(21)17(12)26-18(29)11-6-7-16(25-9-11)28-14(10-4-5-10)8-15(27-28)19(22,23)24/h1-3,6-10H,4-5H2,(H,26,29)
US Patent
n/an/a 72.1n/an/an/an/an/an/a
RHIZEN PHARMACEUTICALS SA
US Patent
Assay Description
Inhibition of CRAC channels was determined following thapsigargin (Sigma, Cat #T9033) induced endoplasmic calcium release in Jurkat cells, (see Yasur...
US Patent US10668051 (2020)
Calcium release-activated calcium (CRAC)
(Homo sapiens (Human))
BDBM141445
(US10668051, Compound Example 122 | US8921364, 122)
Show SMILES Fc1cccc(F)c1NC(=O)c1ccc(nc1)-n1nc(cc1C1CC1)C(F)(F)F
Show InChI InChI=1S/C19H13F5N4O/c20-12-2-1-3-13(21)17(12)26-18(29)11-6-7-16(25-9-11)28-14(10-4-5-10)8-15(27-28)19(22,23)24/h1-3,6-10H,4-5H2,(H,26,29)
US Patent
n/an/a 72.1n/an/an/an/an/a37
Rhizen Pharmaceuticals SA
US Patent
Assay Description
Inhibition of CRAC channels was determined following thapsigargin (Sigma, Cat # T9033) induced endoplasmic calcium release in Jurkat cells. (see Yasu...
US Patent US8921364 (2014)
BindingDB Entry DOI: 10.7270/Q2N58K3N