null
SMILES: COc1ccc(cn1)-c1cc2c(N[C@@H]3CC[C@](C)(C(N)=O)C3(C)C)c(cnn2c1)C(N)=O
InChI Key: InChIKey=WJPORRXQYBLMFT-UZUQRXQVSA-N
Activity Spreadsheet -- Enzyme Inhibition Constant Data from BindingDB
Found 2 hits for monomerid = 141498
Trg + Lig
Ki
nM
ΔG°
kcal/mole
IC50
nM
Kd
nM
EC50/IC50
nM
koff
s-1
kon
M-1s-1
pHTemp
°C
Tyrosine-protein kinase JAK1
(Homo sapiens (Human))
BDBM141498
(US8921368, 338)
Show SMILES COc1ccc(cn1)-c1cc2c(N[C@@H]3CC[C@](C)(C(N)=O)C3(C)C)c(cnn2c1)C(N)=O |r|
Show InChI InChI=1S/C23H28N6O3/c1-22(2)17(7-8-23(22,3)21(25)31)28-19-15(20(24)30)11-27-29-12-14(9-16(19)29)13-5-6-18(32-4)26-10-13/h5-6,9-12,17,28H,7-8H2,1-4H3,(H2,24,30)(H2,25,31)/t17-,23-/m1/s1
Reactome pathway
US Patent
n/an/a 1.20n/an/an/an/a7.425
Bristol-Myers Squibb Company
US Patent
Assay Description
The assay reactions were performed in U-bottom 384-well plates. The final assay volume was 30 ul prepared from 15 ul additions of enzyme and substr...
US Patent US8921368 (2014)
BindingDB Entry DOI: 10.7270/Q2HH6HS7
Tyrosine-protein kinase JAK3
(Homo sapiens (Human))
BDBM141498
(US8921368, 338)
Show SMILES COc1ccc(cn1)-c1cc2c(N[C@@H]3CC[C@](C)(C(N)=O)C3(C)C)c(cnn2c1)C(N)=O |r|
Show InChI InChI=1S/C23H28N6O3/c1-22(2)17(7-8-23(22,3)21(25)31)28-19-15(20(24)30)11-27-29-12-14(9-16(19)29)13-5-6-18(32-4)26-10-13/h5-6,9-12,17,28H,7-8H2,1-4H3,(H2,24,30)(H2,25,31)/t17-,23-/m1/s1
Reactome pathway
US Patent
n/an/a 0.300n/an/an/an/a8.025
Bristol-Myers Squibb Company
US Patent
Assay Description
Kinase reactions consisted of 5 ng of JAK3 enzyme, 30 uM CSKtide substrate, 0.2 uCi gamma-33P ATP, 8 uM ATP in 30 ul kinase buffer (50 mM Hepes, pH ...
US Patent US8921368 (2014)
BindingDB Entry DOI: 10.7270/Q2HH6HS7