BDBM142075 US8933024, 129
SMILES: CCOc1ccc(CNC(=O)n2sc3ncccc3c2=O)cc1OC
InChI Key: InChIKey=BLOYMFKUTBXZFT-UHFFFAOYSA-N
Data: 1 IC50
Activity Spreadsheet -- Enzyme Inhibition Constant Data from BindingDB
Found 1 hit for monomerid = 142075
Trg + Lig
Ki
nM
ΔG°
kcal/mole
IC50
nM
Kd
nM
EC50/IC50
nM
koff
s-1
kon
M-1s-1
pHTemp
°C
Endothelial lipase
(Homo sapiens (Human))
BDBM142075
(US8933024, 129)
Show SMILES CCOc1ccc(CNC(=O)n2sc3ncccc3c2=O)cc1OC
Show InChI InChI=1S/C17H17N3O4S/c1-3-24-13-7-6-11(9-14(13)23-2)10-19-17(22)20-16(21)12-5-4-8-18-15(12)25-20/h4-9H,3,10H2,1-2H3,(H,19,22)
US Patent
n/an/a 230n/an/an/an/an/an/a
Sanofi
US Patent
Assay Description
For characterization of the enzymatic activity of endothelial lipase and the effect of inhibitors, the phospholipase-specific substrate 1,2-bis(4,4-d...
US Patent US8933024 (2015)
BindingDB Entry DOI: 10.7270/Q228069H