BDBM14208 3-{[7-(pyridin-2-yl)-7H-pyrrolo[2,3-d]pyrimidin-2-yl]amino}benzoic acid::pyrrolopyrimidine 31
SMILES: OC(=O)c1cccc(Nc2ncc3ccn(-c4ccccn4)c3n2)c1
InChI Key: InChIKey=HTYXQAZPGGOTIV-UHFFFAOYSA-N
Data: 1 IC50
Activity Spreadsheet -- Enzyme Inhibition Constant Data from BindingDB
Found 1 hit for monomerid = 14208
Trg + Lig
Ki
nM
ΔG°
kcal/mole
IC50
nM
Kd
nM
EC50/IC50
nM
koff
s-1
kon
M-1s-1
pHTemp
°C
Serine/threonine-protein kinase Aurora-A
(Mus musculus (mouse))
BDBM14208
(3-{[7-(pyridin-2-yl)-7H-pyrrolo[2,3-d]pyrimidin-2-...)
Show SMILES OC(=O)c1cccc(Nc2ncc3ccn(-c4ccccn4)c3n2)c1
Show InChI InChI=1S/C18H13N5O2/c24-17(25)12-4-3-5-14(10-12)21-18-20-11-13-7-9-23(16(13)22-18)15-6-1-2-8-19-15/h1-11H,(H,24,25)(H,20,21,22)
Reactome pathway
n/an/a 0.600n/an/an/an/a7.522
Johnson & Johnson Pharmaceutical
Assay Description
The compounds were tested for their ability to inhibit the phosphorylation of serine 10 of histone-H3 by purified recombinant murine Aurora-A enzyme....
Bioorg Med Chem Lett 16: 5778-83 (2006)
Article DOI: 10.1016/j.bmcl.2006.08.080
BindingDB Entry DOI: 10.7270/Q2D21VVZ