BDBM142619 US8933228, 10
SMILES: COc1ccc(cc1)-n1nc(cc1NC(=O)Nc1ccc(Oc2ccnc3[nH]c(=O)n(C)c23)c2ccccc12)C(C)(C)C
InChI Key: InChIKey=GRFBNEAPKLWFPA-UHFFFAOYSA-N
Data: 4 IC50
Activity Spreadsheet -- Enzyme Inhibition Constant Data from BindingDB
Found 4 hits for monomerid = 142619
Trg + Lig
Ki
nM
ΔG°
kcal/mole
IC50
nM
Kd
nM
EC50/IC50
nM
koff
s-1
kon
M-1s-1
pHTemp
°C
Mitogen-activated protein kinase 14
(Homo sapiens (Human))
BDBM142619
(US8933228, 10)
Show SMILES COc1ccc(cc1)-n1nc(cc1NC(=O)Nc1ccc(Oc2ccnc3[nH]c(=O)n(C)c23)c2ccccc12)C(C)(C)C
Show InChI InChI=1S/C32H31N7O4/c1-32(2,3)26-18-27(39(37-26)19-10-12-20(42-5)13-11-19)35-30(40)34-23-14-15-24(22-9-7-6-8-21(22)23)43-25-16-17-33-29-28(25)38(4)31(41)36-29/h6-18H,1-5H3,(H,33,36,41)(H2,34,35,40)
NCI pathway
Reactome pathway
US Patent
n/an/a 6n/an/an/an/an/an/a
Respivert, Ltd.
US Patent
Assay Description
The enzyme inhibitory activity of test compounds was determined by fluorescence resonance energy transfer (FRET) using synthetic peptides labelled wi...
US Patent US8933228 (2015)
BindingDB Entry DOI: 10.7270/Q2RV0MDW
Proto-oncogene tyrosine-protein kinase Src
(Homo sapiens (Human))
BDBM142619
(US8933228, 10)
Show SMILES COc1ccc(cc1)-n1nc(cc1NC(=O)Nc1ccc(Oc2ccnc3[nH]c(=O)n(C)c23)c2ccccc12)C(C)(C)C
Show InChI InChI=1S/C32H31N7O4/c1-32(2,3)26-18-27(39(37-26)19-10-12-20(42-5)13-11-19)35-30(40)34-23-14-15-24(22-9-7-6-8-21(22)23)43-25-16-17-33-29-28(25)38(4)31(41)36-29/h6-18H,1-5H3,(H,33,36,41)(H2,34,35,40)
US Patent
n/an/a 7n/an/an/an/an/an/a
Respivert, Ltd.
US Patent
Assay Description
The enzyme inhibitory activity of test compounds was determined by fluorescence resonance energy transfer (FRET) using synthetic peptides labelled wi...
US Patent US8933228 (2015)
BindingDB Entry DOI: 10.7270/Q2RV0MDW
Tyrosine-protein kinase HCK
(Homo sapiens (Human))
BDBM142619
(US8933228, 10)
Show SMILES COc1ccc(cc1)-n1nc(cc1NC(=O)Nc1ccc(Oc2ccnc3[nH]c(=O)n(C)c23)c2ccccc12)C(C)(C)C
Show InChI InChI=1S/C32H31N7O4/c1-32(2,3)26-18-27(39(37-26)19-10-12-20(42-5)13-11-19)35-30(40)34-23-14-15-24(22-9-7-6-8-21(22)23)43-25-16-17-33-29-28(25)38(4)31(41)36-29/h6-18H,1-5H3,(H,33,36,41)(H2,34,35,40)
Reactome pathway
US Patent
n/an/a 3n/an/an/an/an/an/a
Respivert, Ltd.
US Patent
Assay Description
The enzyme inhibitory activity of test compounds was determined by fluorescence resonance energy transfer (FRET) using synthetic peptides labelled wi...
US Patent US8933228 (2015)
BindingDB Entry DOI: 10.7270/Q2RV0MDW
Mitogen-activated protein kinase 12
(Homo sapiens (Human))
BDBM142619
(US8933228, 10)
Show SMILES COc1ccc(cc1)-n1nc(cc1NC(=O)Nc1ccc(Oc2ccnc3[nH]c(=O)n(C)c23)c2ccccc12)C(C)(C)C
Show InChI InChI=1S/C32H31N7O4/c1-32(2,3)26-18-27(39(37-26)19-10-12-20(42-5)13-11-19)35-30(40)34-23-14-15-24(22-9-7-6-8-21(22)23)43-25-16-17-33-29-28(25)38(4)31(41)36-29/h6-18H,1-5H3,(H,33,36,41)(H2,34,35,40)
Reactome pathway
US Patent
n/an/a 45n/an/an/an/an/an/a
Respivert, Ltd.
US Patent
Assay Description
The enzyme inhibitory activity of test compounds was determined by fluorescence resonance energy transfer (FRET) using synthetic peptides labelled wi...
US Patent US8933228 (2015)
BindingDB Entry DOI: 10.7270/Q2RV0MDW