BDBM142641 US8937058, 9A
SMILES: CC[C@@H]1CC2=CC(=O)CC[C@@H]2[C@H]2CC[C@@]3(CC)[C@@H](CC[C@]33OC(=O)C=C3)[C@H]12
InChI Key: InChIKey=QOKBDMCTJPOERX-VDXMOKCDSA-N
Data: 2 IC50
Activity Spreadsheet -- Enzyme Inhibition Constant Data from BindingDB
Found 2 hits for monomerid = 142641
Trg + Lig
Ki
nM
ΔG°
kcal/mole
IC50
nM
Kd
nM
EC50/IC50
nM
koff
s-1
kon
M-1s-1
pHTemp
°C
Androgen receptor
(Homo sapiens (Human))
BDBM142641
(US8937058, 9A)
Show SMILES CC[C@@H]1CC2=CC(=O)CC[C@@H]2[C@H]2CC[C@@]3(CC)[C@@H](CC[C@]33OC(=O)C=C3)[C@H]12 |r,c:26,t:4|
Show InChI InChI=1S/C24H32O3/c1-3-15-13-16-14-17(25)5-6-18(16)19-7-10-23(4-2)20(22(15)19)8-11-24(23)12-9-21(26)27-24/h9,12,14-15,18-20,22H,3-8,10-11,13H2,1-2H3/t15-,18+,19-,20+,22-,23+,24-/m1/s1
NCI pathway
Reactome pathway
US Patent
n/an/a 76n/an/an/an/an/an/a
TBA
US Patent
Assay Description
The test was carried out as in 1., with the following modifications: cytosol from androgen receptor-expressing insect cells (Hi5) was used, and the r...
US Patent US8937058 (2015)
BindingDB Entry DOI: 10.7270/Q2N29VNG
Progesterone receptor
(Homo sapiens (Human))
BDBM142641
(US8937058, 9A)
Show SMILES CC[C@@H]1CC2=CC(=O)CC[C@@H]2[C@H]2CC[C@@]3(CC)[C@@H](CC[C@]33OC(=O)C=C3)[C@H]12 |r,c:26,t:4|
Show InChI InChI=1S/C24H32O3/c1-3-15-13-16-14-17(25)5-6-18(16)19-7-10-23(4-2)20(22(15)19)8-11-24(23)12-9-21(26)27-24/h9,12,14-15,18-20,22H,3-8,10-11,13H2,1-2H3/t15-,18+,19-,20+,22-,23+,24-/m1/s1
US Patent
n/an/a 670n/an/an/an/an/an/a
TBA
US Patent
Assay Description
Using cytosol from progesterone receptor-expressing insect cells (Hi5), competitive binding to the progesterone receptor was determined from the abil...
US Patent US8937058 (2015)
BindingDB Entry DOI: 10.7270/Q2N29VNG